1,6-Diazatetracyclo[4.3.27,9.12,5]dodecane
- Formula: C10H16N2
- Molecular weight: 164.2474
- IUPAC Standard InChIKey: YCWBYOYZBJXATQ-UHFFFAOYSA-N
- CAS Registry Number: 105090-34-4
- Chemical structure:
View 3d structure (requires JavaScript / HTML 5) - Other names: 1,6-Diazatetracyclo[4.3.27,9.12,5]dodecane

Gas phase ion energetics data

Data compiled by: Sharon G. Lias, John E. Bartmess, Joel F. Liebman, John L. Holmes, Rhoda D. Levin, and W. Gary Mallard
Ionization energy determinations
IE (eV) | Method | Reference |
---|---|---|
6.20 ± 0.05 | EQ | Rumack, 1986 |

References

Rumack, 1986
Rumack, D.,
Title unavailable,
Personal communication to S.G. Lias, 1986. [all data]