Benzene, 1,4-diethenyl-
- Formula: C10H10
- Molecular weight: 130.1864
- IUPAC Standard InChIKey: WEERVPDNCOGWJF-UHFFFAOYSA-N
- CAS Registry Number: 105-06-6
- Chemical structure:
View 3d structure (requires JavaScript / HTML 5) - Other names: 1,4-Divinylbenzene; 1,4-Diethenyl benzene

Phase change data

Data compiled by: Thermodynamics Research Center, NIST Boulder Laboratories, Chris Muzny director
Quantity | Value | Units | Method | Reference | Comment |
---|---|---|---|---|---|
Tfus | 303.15 | K | N/A | Braun and Keppler, 1963 | Uncertainty assigned by TRC = 2. K |
Tfus | 304.15 | K | N/A | Mowry, Renoll, et al., 1946 | Uncertainty assigned by TRC = 2. K |

Reaction thermochemistry data

Data compiled by: Hussein Y. Afeefy, Joel F. Liebman, and Stephen E. Stein
Individual Reactions
By formula: C10H12 = C10H10 + H2
Quantity | Value | Units | Method | Reference | Comment |
---|---|---|---|---|---|
ΔrH° | 126.0 ± 9.5 | kJ/mol | Cm | Lebedev, Rozhkov, et al., 1983 | gas phase; Dehydrogenation, gas phase |

Gas phase ion energetics data

Data compiled by: Sharon G. Lias, Rhoda D. Levin, and Sherif A. Kafafi
Ionization energy determinations
IE (eV) | Method | Reference | Comment |
---|---|---|---|
8.11 | PE | Heilbronner and Jones, 1978 | Vertical value |

Kovats' RI, non-polar column, isothermal

Column type | Active phase | Temperature (C) | I | Reference | Comment |
---|---|---|---|---|---|
Capillary | SE-30 | 70. | 1100.0 | Tóth, 1983 | N2; Column length: 15. m; Column diameter: 0.25 mm |
Capillary | SE-30 | 65. | 1093.2 | Svob, Deur-Siftar, et al., 1974 | He; Column length: 25.5 m; Column diameter: 0.5 mm |

Kovats' RI, polar column, isothermal

Column type | Active phase | Temperature (C) | I | Reference | Comment |
---|---|---|---|---|---|
Capillary | PEG-20M | 70. | 1554.2 | Tóth, 1983 | N2; Column length: 30. m; Column diameter: 0.3 mm |

Normal alkane RI, non-polar column, custom temperature program

Column type | Active phase | I | Reference | Comment |
---|---|---|---|---|
Capillary | Polymethylsiloxane, (PMS-20000) | 1100. | Cornwell and Cordano, 2003 | Program: not specified |
Capillary | OV-1, SE-30, Methyl silicone, SP-2100, OV-101, DB-1, etc. | 1096. | Waggott and Davies, 1984 | Hydrogen; Column length: 50. m; Column diameter: 0.32 mm; Program: not specified |

Normal alkane RI, polar column, custom temperature program

Column type | Active phase | I | Reference | Comment |
---|---|---|---|---|
Capillary | Carbowax 20M | 1554. | Cornwell and Cordano, 2003 | Program: not specified |

Lee's RI, non-polar column, custom temperature program

Column type | Active phase | I | Reference | Comment |
---|---|---|---|---|
Capillary | DB-5 | 184.2 | Fuentes, Font, et al., 2007 | Column length: 60. m; Program: not specified |

References

Braun and Keppler, 1963
Braun, D.; Keppler, H.-G.,
Preparation of Some p-Substituted Styrene Derivatives,
Monatsh. Chem., 1963, 94, 1250. [all data]
Mowry, Renoll, et al., 1946
Mowry, D.T.; Renoll, M.; Huber, W.F.,
Vinyl Aromatic Compounds I. The Vapor Phase Dehydration of Arylmethylcarbinols,
J. Am. Chem. Soc., 1946, 68, 1105. [all data]
Lebedev, Rozhkov, et al., 1983
Lebedev, N.N.; Rozhkov, V.I.; Odabashyan, G.V.; Rozhkova, I.O.; Zaidman, O.A.,
Dehydrogenation of p-diethylbenzene,
Neftekhimiya, 1983, 23, 508-510. [all data]
Heilbronner and Jones, 1978
Heilbronner, E.; Jones, T.B.,
Spectral differences between "isospectral" molecules,
J. Am. Chem. Soc., 1978, 100, 6506. [all data]
Tóth, 1983
Tóth, T.,
Use of capillary gas chromatography in collecting retention and chemical information for the analysis of complex petrochemical mixtures,
J. Chromatogr., 1983, 279, 157-165, https://doi.org/10.1016/S0021-9673(01)93614-3
. [all data]
Svob, Deur-Siftar, et al., 1974
Svob, V.; Deur-Siftar, D.; Cramers, C.A.,
Mechanisms of the thermal degradation of alkylbenzenes,
J. Chromatogr., 1974, 91, 659-675, https://doi.org/10.1016/S0021-9673(01)97946-4
. [all data]
Cornwell and Cordano, 2003
Cornwell, E.; Cordano, G.,
Nueva proposicion para predecir datos de retencion obtenidos mediante cromatografia de gases de hidrocarburos derivados de las naftas,
Revista de la Sociedad Quimica de Mexico, 2003, 47, 1, 38-43. [all data]
Waggott and Davies, 1984
Waggott, A.; Davies, I.W.,
Identification of organic pollutants using linear temperature programmed retention indices (LTPRIs) - Part II, 1984, retrieved from http://dwi.defra.gov.uk/research/completed-research/reports/dwi0383.pdf. [all data]
Fuentes, Font, et al., 2007
Fuentes, M.J.; Font, R.; Gomez-Rico, M.F.; Martin-Gullon, I.,
Pyrolysis and combustion of waste lubricant oil from diesel cars: Decomposition and pollutants,
J. Anal. Appl. Pyrolysis, 2007, 79, 1-2, 215-226, https://doi.org/10.1016/j.jaap.2006.12.004
. [all data]