Benzene, 1,4-diethyl-
- Formula: C10H14
- Molecular weight: 134.2182
- IUPAC Standard InChIKey: DSNHSQKRULAAEI-UHFFFAOYSA-N
- CAS Registry Number: 105-05-5
- Chemical structure:
View 3d structure (requires JavaScript / HTML 5) - Other names: Benzene, p-diethyl-; p-Diethylbenzene; p-Ethylethylbenzene; 1,4-Diethylbenzene; para-Diethylbenzene

Condensed phase thermochemistry data

Data compiled by: Hussein Y. Afeefy, Joel F. Liebman, and Stephen E. Stein
Quantity | Value | Units | Method | Reference | Comment |
---|---|---|---|---|---|
ΔfH°liquid | -72.84 ± 0.96 | kJ/mol | Ccb | Good, 1973 | |
ΔfH°liquid | -73.1 ± 1.8 | kJ/mol | Ccb | Prosen, Johnson, et al., 1946 | |
Quantity | Value | Units | Method | Reference | Comment |
ΔcH°liquid | -5863.08 ± 0.79 | kJ/mol | Ccb | Good, 1973 | Corresponding ΔfHºliquid = -72.84 kJ/mol (simple calculation by NIST; no Washburn corrections) |
ΔcH°liquid | -5862.9 ± 1.8 | kJ/mol | Ccb | Prosen, Johnson, et al., 1946 | Corresponding ΔfHºliquid = -73.01 kJ/mol (simple calculation by NIST; no Washburn corrections) |

Phase change data

Data compiled as indicated in comments:
BS - Robert L. Brown and Stephen E. Stein
TRC - Thermodynamics Research Center, NIST Boulder Laboratories, Chris Muzny director
AC - William E. Acree, Jr., James S. Chickos
Quantity | Value | Units | Method | Reference | Comment |
---|---|---|---|---|---|
Tboil | 456.7 ± 0.6 | K | AVG | N/A | Average of 18 values; Individual data points |
Quantity | Value | Units | Method | Reference | Comment |
Tfus | 229.90 | K | N/A | Birch, Dean, et al., 1949 | Uncertainty assigned by TRC = 0.2 K; TRC |
Tfus | 229.6 | K | N/A | Boord, Perilstein, et al., 1944 | Uncertainty assigned by TRC = 0.6 K; TRC |
Quantity | Value | Units | Method | Reference | Comment |
Tc | 657.9 ± 0.5 | K | N/A | Tsonopoulos and Ambrose, 1995 | |
Tc | 657.89 | K | N/A | Ambrose, Broderick, et al., 1967 | Uncertainty assigned by TRC = 0.15 K; TRC |
Tc | 657.87 | K | N/A | Ambrose, Cox, et al., 1960 | Uncertainty assigned by TRC = 0.03 K; Visual, PRT, IPTS-48, sample wrongly named isobutyl benzene; TRC |
Quantity | Value | Units | Method | Reference | Comment |
Pc | 28.0 ± 0.4 | bar | N/A | Tsonopoulos and Ambrose, 1995 | |
Pc | 28.03 | bar | N/A | Ambrose, Broderick, et al., 1967 | Uncertainty assigned by TRC = 0.07 bar; TRC |
Quantity | Value | Units | Method | Reference | Comment |
ΔvapH° | 52.5 | kJ/mol | N/A | Reid, 1972 | AC |
Enthalpy of vaporization
ΔvapH (kJ/mol) | Temperature (K) | Method | Reference | Comment |
---|---|---|---|---|
45.8 | 384. | A | Stephenson and Malanowski, 1987 | Based on data from 369. to 464. K. See also Forziati, Norris, et al., 1949.; AC |
Antoine Equation Parameters
log10(P) = A − (B / (T + C))
P = vapor pressure (bar)
T = temperature (K)
View plot Requires a JavaScript / HTML 5 canvas capable browser.
Temperature (K) | A | B | C | Reference |
---|---|---|---|---|
369.97 to 457.97 | 4.12544 | 1589.273 | -71.131 | Forziati, Norris, et al., 1949, 2 |

Gas phase ion energetics data

Data evaluated as indicated in comments:
L - Sharon G. Lias
Data compiled as indicated in comments:
LLK - Sharon G. Lias, Rhoda D. Levin, and Sherif A. Kafafi
Quantity | Value | Units | Method | Reference | Comment |
---|---|---|---|---|---|
IE (evaluated) | 8.40 | eV | N/A | N/A | L |
Ionization energy determinations
IE (eV) | Method | Reference | Comment |
---|---|---|---|
8.40 | PE | Bock, Kaim, et al., 1978 | LLK |
8.43 | PE | Gleiter, Hopf, et al., 1980 | Vertical value; LLK |

Reaction thermochemistry data

Data compiled by: Hussein Y. Afeefy, Joel F. Liebman, and Stephen E. Stein
Individual Reactions
By formula: C10H14 = H2 + C10H12
Quantity | Value | Units | Method | Reference | Comment |
---|---|---|---|---|---|
ΔrH° | 31. ± 2. | kcal/mol | Cm | Lebedev, Rozhkov, et al., 1983 | gas phase; Dehydrogenation, gas phase |

Kovats' RI, non-polar column, isothermal

Column type | Active phase | Temperature (C) | I | Reference | Comment |
---|---|---|---|---|---|
Capillary | OV-101 | 100. | 1047. | Dimov and Mekenyan, 1989 | Column length: 50. m; Column diameter: 0.25 mm |
Capillary | OV-101 | 100. | 1046. | Matisová, Kovacicová, et al., 1989 | He; Column length: 50. m; Column diameter: 0.20 mm |
Capillary | OV-101 | 100. | 1046. | Matisová, Rukríglová, et al., 1988 | H2; Column length: 278. m; Column diameter: 0.25 mm |
Capillary | OV-101 | 100. | 1048. | Matisová, Rukríglová, et al., 1988 | H2; Column length: 278. m; Column diameter: 0.25 mm |
Capillary | Squalane | 100. | 1040. | Nabivach and Vasiliev, 1987 | |
Capillary | SE-30 | 70. | 1040.0 | Tóth, 1983 | N2; Column length: 15. m; Column diameter: 0.25 mm |
Capillary | SE-30 | 130. | 1058. | Bredael, 1982 | Column length: 100. m; Column diameter: 0.5 mm |
Capillary | SE-30 | 80. | 1042. | Bredael, 1982 | Column length: 100. m; Column diameter: 0.5 mm |
Capillary | OV-101 | 100. | 1048. | Gerasimenko and Nabivach, 1982 | N2; Column length: 50. m; Column diameter: 0.30 mm |
Capillary | OV-101 | 120. | 1053. | Gerasimenko and Nabivach, 1982 | N2; Column length: 50. m; Column diameter: 0.30 mm |
Capillary | OV-101 | 140. | 1059. | Gerasimenko and Nabivach, 1982 | N2; Column length: 50. m; Column diameter: 0.30 mm |
Capillary | Squalane | 86. | 1036.8 | Macák, Nabivach, et al., 1982 | N2; Column length: 50. m; Column diameter: 0.25 mm |
Capillary | Squalane | 96. | 1039.3 | Macák, Nabivach, et al., 1982 | N2; Column length: 50. m; Column diameter: 0.25 mm |
Capillary | OV-101 | 100. | 1047.9 | Gerasimenko, Kirilenko, et al., 1981 | N2; Column length: 50. m; Column diameter: 0.3 mm |
Capillary | OV-101 | 120. | 1053.4 | Gerasimenko, Kirilenko, et al., 1981 | N2; Column length: 50. m; Column diameter: 0.3 mm |
Capillary | OV-101 | 140. | 1059.3 | Gerasimenko, Kirilenko, et al., 1981 | N2; Column length: 50. m; Column diameter: 0.3 mm |
Capillary | SE-30 | 65. | 1037.1 | Kuchhal, Kumar, et al., 1980 | |
Capillary | Squalane | 80. | 1033.8 | Kuchhal, Kumar, et al., 1980 | Column length: 45.7 m; Column diameter: 0.25 mm |
Capillary | Squalane | 86. | 1036.8 | Nabivach, Bur'yan, et al., 1978 | Column length: 50. m; Column diameter: 0.25 mm |
Capillary | Squalane | 96. | 1039.3 | Nabivach, Bur'yan, et al., 1978 | Column length: 50. m; Column diameter: 0.25 mm |
Capillary | Squalane | 100. | 1040. | Engewald and Wennrich, 1976 | N2; Column length: 100. m; Column diameter: 0.23 mm |
Capillary | Squalane | 80. | 1033.82 | Soják and Rijks, 1976 | H2; Column length: 100. m; Column diameter: 0.25 mm |
Capillary | Squalane | 100. | 1032. | Mitra, Mohan, et al., 1974 | H2; Column length: 50. m; Column diameter: 0.2 mm |
Capillary | SE-30 | 65. | 1036.7 | Svob, Deur-Siftar, et al., 1974 | He; Column length: 25.5 m; Column diameter: 0.5 mm |
Capillary | SE-30 | 65. | 1036.7 | Svob, Deur-Siftar, et al., 1974 | He; Column length: 25.5 m; Column diameter: 0.5 mm |
Capillary | SE-30 | 65. | 1037.1 | Svob and Deur-Siftar, 1974 | He; Column length: 25.5 m; Column diameter: 0.5 mm |
Capillary | Squalane | 100. | 1039.1 | Svob and Deur-Siftar, 1974 | He; Column length: 10.5 m; Column diameter: 0.25 mm |
Packed | Methyl Silicone | 130. | 1055. | Antheaume and Guiochon, 1965 |

Kovats' RI, non-polar column, temperature ramp

Column type | Active phase | I | Reference | Comment |
---|---|---|---|---|
Capillary | OV-101 | 1039. | Hayes and Pitzer, 1982 | 110. m/0.25 mm/0.20 μm, He, 1. K/min; Tstart: 35. C; Tend: 200. C |
Capillary | Apiezon L | 1068. | Louis, 1971 | N2, 1. K/min; Column length: 50. m; Column diameter: 0.25 mm; Tstart: 60. C |

Kovats' RI, non-polar column, custom temperature program

Column type | Active phase | I | Reference | Comment |
---|---|---|---|---|
Capillary | Petrocol DH-100 | 1045.25 | Haagen-Smit Laboratory, 1997 | He; Column length: 100. m; Column diameter: 0.2 mm; Program: 5C(10min) => 5C/min => 50C(48min) => 1.5C/min => 195C(91min) |
Capillary | Squalane | 1042. | Papazova and Pankova, 1975 | N2; Column length: 100. m; Column diameter: 0.25 mm; Program: not specified |
Capillary | Squalane | 1048. | Papazova and Pankova, 1975 | N2; Column length: 100. m; Column diameter: 0.25 mm; Program: not specified |

Kovats' RI, polar column, isothermal

Column type | Active phase | Temperature (C) | I | Reference | Comment |
---|---|---|---|---|---|
Capillary | PEG-20M | 70. | 1305.2 | Tóth, 1983 | N2; Column length: 30. m; Column diameter: 0.3 mm |
Capillary | Carbowax 20M | 90. | 1283.6 | Kuchhal, Kumar, et al., 1980 | |
Capillary | Carbowax 20M | 100. | 1289.4 | Engewald and Wennrich, 1976 | N2; Column length: 100. m; Column diameter: 0.23 mm |
Capillary | Carbowax 20M | 90. | 1283.6 | Döring, Estel, et al., 1974 | Column length: 100. m; Column diameter: 0.2 mm |

Van Den Dool and Kratz RI, non-polar column, temperature ramp

Column type | Active phase | I | Reference | Comment |
---|---|---|---|---|
Capillary | Petrocol DH | 1046.8 | Censullo, Jones, et al., 2003 | 50. m/0.25 mm/0.5 μm, He, 35. C @ 10. min, 3. K/min, 200. C @ 10. min |
Capillary | DB-5 | 1070.1 | Xu, van Stee, et al., 2003 | 30. m/0.25 mm/1. μm, He, 2.5 K/min; Tstart: 50. C; Tend: 200. C |
Capillary | HP-5 | 1056. | Isidorov, Krajewska, et al., 2001 | 30. m/0.25 mm/0.25 μm, He, 3. K/min; Tstart: 40. C; Tend: 180. C |
Capillary | OV-101 | 1040.5 | Yin, Liu, et al., 2001 | N2, 1. K/min; Column length: 80. m; Column diameter: 0.22 mm; Tstart: 30. C; Tend: 130. C |
Capillary | Petrocol DH | 1040.66 | White, Douglas, et al., 1992 | 100. m/0.25 mm/0.5 μm, He, 1. K/min; Tstart: 30. C; Tend: 220. C |
Capillary | Petrocol DH | 1040.69 | White, Douglas, et al., 1992 | 100. m/0.25 mm/0.5 μm, He, 1. K/min; Tstart: 30. C; Tend: 220. C |
Capillary | Petrocol DH | 1041. | White, Hackett, et al., 1992 | 100. m/0.25 mm/0.5 μm, He, 1. K/min; Tstart: 30. C; Tend: 220. C |
Capillary | SPB-1 | 1036. | Huang, Bruechert, et al., 1987 | 60. m/0.25 mm/0.25 μm, He, 35. C @ 10. min, 2. K/min, 235. C @ 40. min |
Capillary | SPB-1 | 1036. | Huang, Bruechert, et al., 1987 | 60. m/0.25 mm/0.25 μm, He, 35. C @ 10. min, 2. K/min, 235. C @ 40. min |
Capillary | Ultra-1 | 1036.33 | Haynes and Pitzer, 1985 | 50. m/0.22 mm/0.33 μm, He, 1. K/min; Tstart: -30. C; Tend: 240. C |
Capillary | Ultra-1 | 1039.17 | Haynes and Pitzer, 1985 | 50. m/0.22 mm/0.33 μm, He, 2. K/min; Tstart: -30. C; Tend: 240. C |
Capillary | Ultra-1 | 1042.04 | Haynes and Pitzer, 1985 | 50. m/0.22 mm/0.33 μm, He, 3. K/min; Tstart: -30. C; Tend: 240. C |
Capillary | Ultra-2 | 1053.74 | Haynes and Pitzer, 1985 | 50. m/0.22 mm/0.33 μm, He, 1. K/min; Tstart: -30. C; Tend: 240. C |
Capillary | Ultra-2 | 1057.31 | Haynes and Pitzer, 1985 | 50. m/0.22 mm/0.33 μm, He, 2. K/min; Tstart: -30. C; Tend: 240. C |
Capillary | Ultra-2 | 1060.01 | Haynes and Pitzer, 1985 | 50. m/0.22 mm/0.33 μm, He, 3. K/min; Tstart: -30. C; Tend: 240. C |
Capillary | OV-101 | 1039. | Hayes and Pitzer, 1981 | 108. m/0.25 mm/0.2 μm, 1. K/min; Tstart: 35. C; Tend: 200. C |

Van Den Dool and Kratz RI, polar column, temperature ramp

Column type | Active phase | I | Reference | Comment |
---|---|---|---|---|
Capillary | CP-Wax 52CB | 1293. | Alasalvar, Taylor, et al., 2005 | 60. m/0.25 mm/0.25 μm, 35. C @ 4. min, 3. K/min; Tend: 203. C |
Capillary | Supelcowax-10 | 1312. | Chung, Fung, et al., 2005 | 60. m/0.25 mm/0.25 μm, 35. C @ 5. min, 6. K/min, 195. C @ 60. min |
Capillary | Supelcowax-10 | 1320. | Elmore, Nisyrios, et al., 2005 | 60. m/0.25 mm/0.25 μm, He, 40. C @ 2. min, 4. K/min; Tend: 280. C |
Capillary | Supelcowax-10 | 1315. | Chung, 1999 | 60. m/0.25 mm/0.25 μm, He, 35. C @ 5. min, 2. K/min, 195. C @ 90. min |
Capillary | DB-Wax | 1300. | Sumitani, Suekane, et al., 1994 | He, 40. C @ 5. min, 3. K/min; Column length: 60. m; Column diameter: 0.25 mm; Tend: 200. C |
Capillary | Supelcowax-10 | 1305. | Vejaphan, Hsieh, et al., 1988 | 60. m/0.25 mm/0.25 μm, 40. C @ 5. min, 2. K/min, 175. C @ 20. min |
Capillary | Supelcowax-10 | 1306. | Vejaphan, Hsieh, et al., 1988 | 60. m/0.25 mm/0.25 μm, 40. C @ 5. min, 2. K/min, 175. C @ 20. min |

Normal alkane RI, non-polar column, isothermal

Column type | Active phase | Temperature (C) | I | Reference | Comment |
---|---|---|---|---|---|
Capillary | SE-30 | 100. | 1044. | Vodenkova, Leol'ko, et al., 2005 | He; Column length: 50. m; Column diameter: 0.25 mm |
Capillary | OV-101 | 100. | 1046. | Tian, 1993 | Column length: 50. m; Column diameter: 0.20 mm |
Capillary | OV-101 | 100. | 1048. | Tian, 1993 | Column length: 50. m; Column diameter: 0.20 mm |
Capillary | OV-101 | 120. | 1053. | Tian, 1993 | Column length: 50. m; Column diameter: 0.20 mm |
Capillary | OV-101 | 120. | 1053. | Tian, 1993 | Column length: 50. m; Column diameter: 0.20 mm |
Capillary | Squalane | 95.4 | 1030. | Sojak and Vigdergauz, 1978 | H2 |
Capillary | Squalane | 110. | 1042. | Papazova and Pankova, 1975 | N2; Column length: 100. m; Column diameter: 0.25 mm |
Capillary | Squalane | 130. | 1048. | Papazova and Pankova, 1975 | N2; Column length: 100. m; Column diameter: 0.25 mm |
Packed | Polydimethyl siloxane | 110. | 1053. | Ferrand, 1962 |

Normal alkane RI, non-polar column, temperature ramp

Column type | Active phase | I | Reference | Comment |
---|---|---|---|---|
Capillary | Polydimethyl siloxane: CP-Sil 5 CB | 1045. | Bramston-Cook, 2013 | 60. m/0.25 mm/1.0 μm, Helium, 45. C @ 1.45 min, 3.6 K/min, 210. C @ 2.72 min |
Capillary | Petrocol DH | 1045. | Supelco, 2012 | 100. m/0.25 mm/0.50 μm, Helium, 20. C @ 15. min, 15. K/min, 220. C @ 30. min |
Capillary | HP-1 | 1069. | Castel, Fernandez, et al., 2006 | 50. m/0.2 mm/0.33 μm, He, 60. C @ 4. min, 2. K/min, 250. C @ 30. min |
Capillary | BP-1 | 1051. | Health Safety Executive, 2000 | 50. m/0.22 mm/0.75 μm, He, 5. K/min; Tstart: 50. C; Tend: 200. C |
Capillary | OV-1 | 1043. | Orav, Kailas, et al., 1999 | 2. K/min; Tstart: 50. C; Tend: 160. C |
Capillary | CP Sil 5 CB | 1038. | Hartgers, Damste, et al., 1992 | 25. m/0.32 mm/0.45 μm, He, 0. C @ 5. min, 3. K/min, 320. C @ 10. min |
Capillary | OV-101 | 1029. | Misharina, Golovnya, et al., 1991 | 50. m/0.32 mm/0.5 μm, He, 4. K/min; Tstart: 50. C; Tend: 250. C |

Normal alkane RI, non-polar column, custom temperature program

Column type | Active phase | I | Reference | Comment |
---|---|---|---|---|
Capillary | DB-5 MS | 1066. | Cajka, Hajslova, et al., 2007 | 30. m/0.25 mm/0.25 μm, Helium; Program: 45 0C (0.75 min) 10 0C/min -> 200 0C 30 0C/min -> 245 0C (1.25 min) |
Capillary | Methyl Silicone | 1055. | Blunden, Aneja, et al., 2005 | 60. m/0.32 mm/1.0 μm, Helium; Program: -50 0C (2 min) 8 0C/min -> 200 0C (7.75 min) 25 0C -> 225 0C (8 min) |
Capillary | SE-30 | 1080. | Vinogradov, 2004 | Program: not specified |
Capillary | Polymethylsiloxane, (PMS-20000) | 1040. | Cornwell and Cordano, 2003 | Program: not specified |
Capillary | SE-30 | 1040. | Xiuhua, Zhang, et al., 1996 | Program: not specified |
Capillary | SE-30 | 1047. | Xiuhua, Zhang, et al., 1996 | Program: not specified |
Capillary | OV-101 | 1047. | Matisová, Juranyiová, et al., 1991 | 52. m/0.25 mm/0.38 μm, H2; Program: 70 - 160 C at 1.5 deg/min; 160 - 280 C at 15 deg/min 15 min at 280 C |
Capillary | Squalane | 1040.7 | Dimov and Mekenyan, 1989 | Program: not specified |
Capillary | OV-1, SE-30, Methyl silicone, SP-2100, OV-101, DB-1, etc. | 1037. | Waggott and Davies, 1984 | Hydrogen; Column length: 50. m; Column diameter: 0.32 mm; Program: not specified |
Capillary | OV-1, SE-30, Methyl silicone, SP-2100, OV-101, DB-1, etc. | 1039. | Waggott and Davies, 1984 | Hydrogen; Column length: 50. m; Column diameter: 0.32 mm; Program: not specified |
Capillary | OV-1, SE-30, Methyl silicone, SP-2100, OV-101, DB-1, etc. | 1041. | Waggott and Davies, 1984 | Hydrogen; Column length: 50. m; Column diameter: 0.32 mm; Program: not specified |
Capillary | OV-1, SE-30, Methyl silicone, SP-2100, OV-101, DB-1, etc. | 1042. | Waggott and Davies, 1984 | Hydrogen; Column length: 50. m; Column diameter: 0.32 mm; Program: not specified |
Capillary | OV-1, SE-30, Methyl silicone, SP-2100, OV-101, DB-1, etc. | 1043. | Waggott and Davies, 1984 | Hydrogen; Column length: 50. m; Column diameter: 0.32 mm; Program: not specified |
Capillary | OV-1, SE-30, Methyl silicone, SP-2100, OV-101, DB-1, etc. | 1084. | Waggott and Davies, 1984 | Hydrogen; Column length: 50. m; Column diameter: 0.32 mm; Program: not specified |

Normal alkane RI, polar column, isothermal

Column type | Active phase | Temperature (C) | I | Reference | Comment |
---|---|---|---|---|---|
Capillary | PEG-40M | 80. | 1307. | Nesterov, Nesterova, et al., 2000 | Column length: 50. m |
Capillary | Carbowax 20M | 90. | 1284. | Sutter, Peterson, et al., 1997 |

Normal alkane RI, polar column, custom temperature program

Column type | Active phase | I | Reference | Comment |
---|---|---|---|---|
Capillary | Carbowax 20M | 1353. | Vinogradov, 2004 | Program: not specified |
Capillary | Carbowax 20M | 1305. | Cornwell and Cordano, 2003 | Program: not specified |
Capillary | Carbowax 20M | 1284. | Ivanciuc, Ivanciuc, et al., 2001 | Program: not specified |
Capillary | PEG-20M | 1305. | Xiuhua, Zhang, et al., 1996 | Program: not specified |
Capillary | Carbowax 20M | 1291.5 | Dimov and Mekenyan, 1989 | Program: not specified |

References

Good, 1973
Good, W.D.,
The enthalpies of combustion and formation of n-butylbenzene, the diethylbenzenes, the methyl-n-propylbenzenes, and the methyl-iso-propylbenzenes,
J. Chem. Thermodyn., 1973, 5, 707-714. [all data]
Prosen, Johnson, et al., 1946
Prosen, E.J.; Johnson, W.H.; Rossini, F.D.,
Heats of combustion and formation at 25°C of the alkylbenzenes through C10H14, and of the higher normal monoalkylbenzenes,
J. Res. NBS, 1946, 36, 455-461. [all data]
Birch, Dean, et al., 1949
Birch, S.F.; Dean, R.A.; Fidler, F.A.; Lowry, R.A.,
The preparation of the c(10) monocyclic aromatic hydrocarbons,
J. Am. Chem. Soc., 1949, 71, 1362. [all data]
Boord, Perilstein, et al., 1944
Boord, C.E.; Perilstein, W.L.; Greenlee, K.W.,
, Am. Pet. Inst. Hydrocarbon Res. Proj., Sixth Annu. Ref., Ohio State Univ., Aug. 31, 1944. [all data]
Tsonopoulos and Ambrose, 1995
Tsonopoulos, C.; Ambrose, D.,
Vapor-Liquid Critical Properties of Elements and Compounds. 3. Aromatic Hydrocarbons,
J. Chem. Eng. Data, 1995, 40, 547-558. [all data]
Ambrose, Broderick, et al., 1967
Ambrose, D.; Broderick, B.E.; Townsend, R.,
The Vapour Pressures above the Normal Boiling Point and the Critical Pressures of Some Aromatic Hydrocarbons,
J. Chem. Soc. , 1967, 1967, 1967, 633-41. [all data]
Ambrose, Cox, et al., 1960
Ambrose, D.; Cox, J.D.; Townsend, R.,
The critical temperatures of forty organic compounds,
Trans. Faraday Soc., 1960, 56, 1452. [all data]
Reid, 1972
Reid, Robert C.,
Handbook on vapor pressure and heats of vaporization of hydrocarbons and related compounds, R. C. Wilhort and B. J. Zwolinski, Texas A Research Foundation. College Station, Texas(1971). 329 pages.$10.00,
AIChE J., 1972, 18, 6, 1278-1278, https://doi.org/10.1002/aic.690180637
. [all data]
Stephenson and Malanowski, 1987
Stephenson, Richard M.; Malanowski, Stanislaw,
Handbook of the Thermodynamics of Organic Compounds, 1987, https://doi.org/10.1007/978-94-009-3173-2
. [all data]
Forziati, Norris, et al., 1949
Forziati, Alphonse F.; Norris, William R.; Rossini, Frederick D.,
Vapor pressures and boiling points of sixty API-NBS hydrocarbons,
J. RES. NATL. BUR. STAN., 1949, 43, 6, 555-17, https://doi.org/10.6028/jres.043.050
. [all data]
Forziati, Norris, et al., 1949, 2
Forziati, A.F.; Norris, W.R.; Rossini, F.D.,
Vapor Pressures and Boiling Points of Sixty API-NBS Hydrocarbons,
J. Res. Natl. Bur. Stand. (U.S.), 1949, 43, 6, 555-563, https://doi.org/10.6028/jres.043.050
. [all data]
Bock, Kaim, et al., 1978
Bock, H.; Kaim, W.; Rohwer, H.E.,
Die hyperkonjugative Stabilisierung von p-Xylol-Radikalkationen durch (H3C)3Si-Substituenten,
Chem. Ber., 1978, 111, 3573. [all data]
Gleiter, Hopf, et al., 1980
Gleiter, R.; Hopf, H.; Eckert-Maksic, M.; Noble, K.-L.,
Photoelektronenspektren von [8]paracyclophan und [8]paracyclophan-4-en. Eine ermittlung des induktiven und hyperkonjugativen effekts fur [n]Ppracyclophane,
Chem. Ber., 1980, 113, 3401. [all data]