Quinoline, 5,6,7,8-tetrahydro-
- Formula: C9H11N
- Molecular weight: 133.1903
- IUPAC Standard InChIKey: YQDGQEKUTLYWJU-UHFFFAOYSA-N
- CAS Registry Number: 10500-57-9
- Chemical structure:
View 3d structure (requires JavaScript / HTML 5) - Other names: 5,6,7,8-Tetrahydroquinoline; 2,3-Cyclohexenopyridine

Gas phase thermochemistry data

Data compiled by: Hussein Y. Afeefy, Joel F. Liebman, and Stephen E. Stein
Quantity | Value | Units | Method | Reference | Comment |
---|---|---|---|---|---|
ΔfH°gas | 71.0 ± 1.2 | kJ/mol | Ccr | Steele, Chirico, et al., 1989 |

Condensed phase thermochemistry data

Data compiled as indicated in comments:
ALS - Hussein Y. Afeefy, Joel F. Liebman, and Stephen E. Stein
DH - Eugene S. Domalski and Elizabeth D. Hearing
Quantity | Value | Units | Method | Reference | Comment |
---|---|---|---|---|---|
ΔfH°liquid | 13.4 ± 1.2 | kJ/mol | Ccr | Steele, Chirico, et al., 1989 | ALS |
Quantity | Value | Units | Method | Reference | Comment |
ΔcH°liquid | -5127.0 ± 1.2 | kJ/mol | Ccr | Steele, Chirico, et al., 1989 | ALS |
Quantity | Value | Units | Method | Reference | Comment |
S°liquid | 248.73 | J/mol*K | N/A | Steele, Chirico, et al., 1989, 2 | DH |
S°liquid | 248.69 | J/mol*K | N/A | Steele, Chirico, et al., 1986 | DH |
Constant pressure heat capacity of liquid
Cp,liquid (J/mol*K) | Temperature (K) | Reference | Comment |
---|---|---|---|
217.41 | 298.15 | Steele, Chirico, et al., 1989, 2 | T = 5 to 440 K.; DH |
217.33 | 298.15 | Steele, Chirico, et al., 1986 | T = 6 to 450 K.; DH |

Phase change data

Data compiled as indicated in comments:
BS - Robert L. Brown and Stephen E. Stein
DH - Eugene S. Domalski and Elizabeth D. Hearing
TRC - Thermodynamics Research Center, NIST Boulder Laboratories, Chris Muzny director
ALS - Hussein Y. Afeefy, Joel F. Liebman, and Stephen E. Stein
DRB - Donald R. Burgess, Jr.
AC - William E. Acree, Jr., James S. Chickos
Quantity | Value | Units | Method | Reference | Comment |
---|---|---|---|---|---|
Tboil | 491.2 | K | N/A | Aldrich Chemical Company Inc., 1990 | BS |
Tboil | 495.2 | K | N/A | Weast and Grasselli, 1989 | BS |
Quantity | Value | Units | Method | Reference | Comment |
Tfus | 222.634 | K | N/A | Steele, Chirico, et al., 1986 | DH |
Quantity | Value | Units | Method | Reference | Comment |
Ttriple | 222.630 | K | N/A | Steele, Chirico, et al., 1989, 3 | Crystal phase 1 phase; Uncertainty assigned by TRC = 0.01 K; TRC |
Quantity | Value | Units | Method | Reference | Comment |
ΔvapH° | 57.56 | kJ/mol | V | Steele, Chirico, et al., 1989 | ALS |
ΔvapH° | 57.6 | kJ/mol | N/A | Steele, Chirico, et al., 1989 | DRB |
ΔvapH° | 57.6 ± 0.2 | kJ/mol | IP,EB | Steele, Chirico, et al., 1989 | Based on data from 303. to 544. K.; AC |
Reduced pressure boiling point
Tboil (K) | Pressure (bar) | Reference | Comment |
---|---|---|---|
366.7 | 0.016 | Weast and Grasselli, 1989 | BS |
Enthalpy of vaporization
ΔvapH (kJ/mol) | Temperature (K) | Method | Reference | Comment |
---|---|---|---|---|
56.1 ± 0.1 | 320. | IP,EB | Steele, Chirico, et al., 1989 | Based on data from 303. to 544. K.; AC |
53.6 ± 0.1 | 360. | IP,EB | Steele, Chirico, et al., 1989 | Based on data from 303. to 544. K.; AC |
51.1 ± 0.1 | 400. | IP,EB | Steele, Chirico, et al., 1989 | Based on data from 303. to 544. K.; AC |
48.7 ± 0.3 | 440. | IP,EB | Steele, Chirico, et al., 1989 | Based on data from 303. to 544. K.; AC |
46.2 ± 0.4 | 480. | IP,EB | Steele, Chirico, et al., 1989 | Based on data from 303. to 544. K.; AC |
43.5 ± 0.5 | 520. | IP,EB | Steele, Chirico, et al., 1989 | Based on data from 303. to 544. K.; AC |
Enthalpy of fusion
ΔfusH (kJ/mol) | Temperature (K) | Reference | Comment |
---|---|---|---|
9.08 | 222.7 | Acree, 1991 | AC |
Enthalpy of phase transition
ΔHtrs (kJ/mol) | Temperature (K) | Initial Phase | Final Phase | Reference | Comment |
---|---|---|---|---|---|
9.0717 | 222.634 | crystaline, I | liquid | Steele, Chirico, et al., 1989, 2 | DH |
Entropy of phase transition
ΔStrs (J/mol*K) | Temperature (K) | Initial Phase | Final Phase | Reference | Comment |
---|---|---|---|---|---|
40.75 | 222.634 | crystaline, I | liquid | Steele, Chirico, et al., 1989, 2 | DH |

Gas phase ion energetics data

Data evaluated as indicated in comments:
HL - Edward P. Hunter and Sharon G. Lias
Data compiled as indicated in comments:
LLK - Sharon G. Lias, Rhoda D. Levin, and Sherif A. Kafafi
Quantity | Value | Units | Method | Reference | Comment |
---|---|---|---|---|---|
Proton affinity (review) | 966.0 | kJ/mol | N/A | Hunter and Lias, 1998 | HL |
Quantity | Value | Units | Method | Reference | Comment |
Gas basicity | 934.1 | kJ/mol | N/A | Hunter and Lias, 1998 | HL |
Ionization energy determinations
IE (eV) | Method | Reference | Comment |
---|---|---|---|
9.1 | PE | Aue and Bowers, 1979 | Vertical value; LLK |

Van Den Dool and Kratz RI, polar column, temperature ramp

Column type | Active phase | I | Reference | Comment |
---|---|---|---|---|
Capillary | DB-Wax | 1832. | Shimoda, Shiratsuchi, et al., 1996 | 60. m/0.25 mm/0.25 μm, He, 2. K/min, 230. C @ 60. min; Tstart: 50. C |

Normal alkane RI, non-polar column, temperature ramp

Column type | Active phase | I | Reference | Comment |
---|---|---|---|---|
Capillary | DB-1 | 1257. | Yu and Ho, 1995 | 60. m/0.25 mm/1. μm, He, 40. C @ 5. min, 2. K/min, 260. C @ 60. min |

Lee's RI, non-polar column, temperature ramp

Column type | Active phase | I | Reference | Comment |
---|---|---|---|---|
Capillary | SE-52 | 226.54 | Hasegawa, Usami, et al., 1990 | 2. K/min; Column length: 12. m; Column diameter: 0.25 mm; Tstart: 50. C; Tend: 270. C |

Lee's RI, non-polar column, custom temperature program

Column type | Active phase | I | Reference | Comment |
---|---|---|---|---|
Capillary | SE-52 | 227.19 | Hasegawa, Usami, et al., 1990 | Column length: 12. m; Column diameter: 0.25 mm; Program: not specified |

References

Steele, Chirico, et al., 1989
Steele, W.V.; Chirico, R.D.; Hossenlopp, I.A.; Nguyen, A.; Smith, N.K.; Gammon, B.E.,
The thermodynamic properties of 1,2,3,4- and 5,6,7,8-tetrahydroquinolines,
J. Chem. Thermodyn., 1989, 21, 1121-1149. [all data]
Steele, Chirico, et al., 1989, 2
Steele, W.V.; Chirico, R.D.; Hossenlopp, I.A.; Nguyen, A.; Smith, N.K.; Gammon, B.E.,
The thermodynamic properties of the five benzoquinolines,
J. Chem. Thermodyn., 1989, 21, 81-107. [all data]
Steele, Chirico, et al., 1986
Steele, W.V.; Chirico, R.D.; Collier, W.B.; Hossenlopp, I.A.; Nguyen, A.; Strube, M.M.,
Thermochemical and thermophysical properties of organic nitrogen compounds found in fossil materials,
NIPER Report, 1986, 188, 112p. [all data]
Aldrich Chemical Company Inc., 1990
Aldrich Chemical Company Inc.,
Catalog Handbook of Fine Chemicals, Aldrich Chemical Company, Inc., Milwaukee WI, 1990, 1. [all data]
Weast and Grasselli, 1989
CRC Handbook of Data on Organic Compounds, 2nd Editon, Weast,R.C and Grasselli, J.G., ed(s)., CRC Press, Inc., Boca Raton, FL, 1989, 1. [all data]
Steele, Chirico, et al., 1989, 3
Steele, W.V.; Chirico, R.D.; Hossenlopp, I.A.; Nguyen, A.; Smith, N.K.; Gammon, B.E.,
The thermodynamic properties of 1,2,3,4- and 5,6,7,8-tetrahydroquinolines,
J. Chem. Thermodyn., 1989, 21, 1121. [all data]
Acree, 1991
Acree, William E.,
Thermodynamic properties of organic compounds: enthalpy of fusion and melting point temperature compilation,
Thermochimica Acta, 1991, 189, 1, 37-56, https://doi.org/10.1016/0040-6031(91)87098-H
. [all data]
Hunter and Lias, 1998
Hunter, E.P.; Lias, S.G.,
Evaluated Gas Phase Basicities and Proton Affinities of Molecules: An Update,
J. Phys. Chem. Ref. Data, 1998, 27, 3, 413-656, https://doi.org/10.1063/1.556018
. [all data]
Aue and Bowers, 1979
Aue, D.H.; Bowers, M.T.,
Chapter 9. Stabilities of positive ions from equilibrium gas phase basicity measurements
in Ions Chemistry,, ed. M.T. Bowers, 1979. [all data]
Goodar and Mariella, 1957
Goodar, E.; Mariella, R.P.,
J. Am. Chem. Soc., 1957, 79, 1402. [all data]
Shimoda, Shiratsuchi, et al., 1996
Shimoda, M.; Shiratsuchi, H.; Nakada, Y.; Wu, Y.; Osajima, Y.,
Identification and sensory characterization of volatile flavor compounds in sesame seed oil,
J. Agric. Food Chem., 1996, 44, 12, 3909-3912, https://doi.org/10.1021/jf960115f
. [all data]
Yu and Ho, 1995
Yu, T.-H.; Ho, C.-T.,
Volatile compounds generated from thermal reaction of methionine and methionine sulfoxide with or without glucose,
J. Agric. Food Chem., 1995, 43, 6, 1641-1646, https://doi.org/10.1021/jf00054a043
. [all data]
Hasegawa, Usami, et al., 1990
Hasegawa, K.; Usami, S.; Higashide, A.,
Analysis of amino polycyclic aromatic hydrocarbons and polycyclic aromatic nitrogen heterocycles,
Nippon Kagaku Kaishi, 1990, 7, 777-788, https://doi.org/10.1246/nikkashi.1990.777
. [all data]