α-Chlorocyclooctanone oxime
- Formula: C8H14ClNO
- Molecular weight: 175.656
- IUPAC Standard InChIKey: CLUUAPBIIZAOJL-UHFFFAOYSA-N
- CAS Registry Number: 10499-33-9
- Chemical structure:
View 3d structure (requires JavaScript / HTML 5) - Permanent link for this species. Use this link for bookmarking this species for future reference.

Gas phase ion energetics data

Data compiled as indicated in comments:
LLK - Sharon G. Lias, Rhoda D. Levin, and Sherif A. Kafafi
Ionization energy determinations
IE (eV) | Method | Reference | Comment |
---|---|---|---|
9.19 ± 0.03 | PI | Golubitskii, Kulikov, et al., 1979 | LLK |
Appearance energy determinations
Ion | AE (eV) | Other Products | Method | Reference | Comment |
---|---|---|---|---|---|
C6H10ClNO+ | 9.66 ± 0.05 | C2H4 | PI | Golubitskii, Kulikov, et al., 1979 | LLK |
C8H14NO+ | 9.81 ± 0.05 | Cl | PI | Golubitskii, Kulikov, et al., 1979 | LLK |

References

Golubitskii, Kulikov, et al., 1979
Golubitskii, A.E.; Kulikov, N.S.; Zyakun, A.M.; Valovoi, V.A.; Alekseev, A.M.; Volkov, V.N.,
Photoionization mass spectra of alicyclic compounds with various substituents, and their ionization energies and appearance energies,
Bull. Acad. Sci. USSR, Div. Chem. Sci., 1979, 11, 2602. [all data]