4-Methylmercaptoaniline
- Formula: C7H9NS
- Molecular weight: 139.218
- IUPAC Standard InChIKey: YKFROQCFVXOUPW-UHFFFAOYSA-N
- CAS Registry Number: 104-96-1
- Chemical structure:
View 3d structure (requires JavaScript / HTML 5) - Other names: 4-(Methylthio)aniline; Benzenamine, 4-(methylthio)-; p-(Methylthio)aniline; p-Aminophenyl methyl sulfide; p-Aminothioanisole; p-Thioanisidine; p-Thiomethoxyaniline; Aniline, p-(methylthio)-; 4-(Methylthio)benzenamine; 4-Aminothioanisole; (4-(Methylthio)phenyl)amine; NSC 75842

Phase change data

Data compiled by: Robert L. Brown and Stephen E. Stein
Quantity | Value | Units | Method | Reference | Comment |
---|---|---|---|---|---|
Tboil | 545.7 | K | N/A | Weast and Grasselli, 1989 | |
Tboil | 545. to 546. | K | N/A | Buckingham and Donaghy, 1982 |
Reduced pressure boiling point
Tboil (K) | Pressure (bar) | Reference |
---|---|---|
413.2 | 0.020 | Weast and Grasselli, 1989 |
412. | 0.020 | Buckingham and Donaghy, 1982 |

Gas phase ion energetics data

Data compiled by: Sharon G. Lias, Rhoda D. Levin, and Sherif A. Kafafi
Ionization energy determinations
IE (eV) | Method | Reference | Comment |
---|---|---|---|
7.6 | PE | Chmutova, Vtyurina, et al., 1979 | Vertical value |
7.60 ± 0.01 | PE | Bernardi, Distefano, et al., 1975 | Vertical value |

References

Weast and Grasselli, 1989
CRC Handbook of Data on Organic Compounds, 2nd Editon, Weast,R.C and Grasselli, J.G., ed(s)., CRC Press, Inc., Boca Raton, FL, 1989, 1. [all data]
Buckingham and Donaghy, 1982
Buckingham, J.; Donaghy, S.M.,
Dictionary of Organic Compounds: Fifth Edition, Chapman and Hall, New York, 1982, 1. [all data]
Chmutova, Vtyurina, et al., 1979
Chmutova, G.A.; Vtyurina, N.N.; Komina, T.V.; Gazizov, I.G.; Bock, H.,
Molecular-orbital characteristics of anisole isologs X-C6H4-ECH3 (E = O, S, Se) containing donor substituents X,
Zh. Obshch. Khim., 1979, 49, 192. [all data]
Bernardi, Distefano, et al., 1975
Bernardi, F.; Distefano, G.; Mangini, A.; Pignataro, S.; Spunta, G.,
Photoelectron spectra of substituted anisoles thioanisoles,
J. Electron Spectrosc. Relat. Phenom., 1975, 7, 457. [all data]