Benzene, 1-bromo-4-(methylthio)-
- Formula: C7H7BrS
- Molecular weight: 203.099
- IUPAC Standard InChIKey: YEUYZNNBXLMFCW-UHFFFAOYSA-N
- CAS Registry Number: 104-95-0
- Chemical structure:
View 3d structure (requires JavaScript / HTML 5) - Other names: p-Bromo(methylthio)benzene; 1-Bromo-4-(methylthio)benzene; 4-Bromo(methylthio)benzene; p-Bromophenyl methyl sulfide; 4-Bromophenyl methyl sulfide; p-Bromothioanisole; 4-Bromothioanisole; p-(Methylthio)phenyl bromide; Sulfide, p-bromophenyl methyl; Methyl 4-bromophenylsulfide; NSC 73383; 4-bromophenyl methyl sulphide

Phase change data

Data compiled by: Robert L. Brown and Stephen E. Stein
Quantity | Value | Units | Method | Reference | Comment |
---|---|---|---|---|---|
Tboil | 528. | K | N/A | Buckingham and Donaghy, 1982 | |
Quantity | Value | Units | Method | Reference | Comment |
Tfus | 311. to 313. | K | N/A | Buckingham and Donaghy, 1982 |

Gas phase ion energetics data

Data compiled by: Sharon G. Lias, Rhoda D. Levin, and Sherif A. Kafafi
Ionization energy determinations
IE (eV) | Method | Reference | Comment |
---|---|---|---|
7.5 | PE | Baker, Armen, et al., 1981 | |
7.8 | PE | Baker, Armen, et al., 1981 | Vertical value |
8.17 ± 0.05 | PE | Colonna, Danieli, et al., 1976 | Vertical value |

References

Buckingham and Donaghy, 1982
Buckingham, J.; Donaghy, S.M.,
Dictionary of Organic Compounds: Fifth Edition, Chapman and Hall, New York, 1982, 1. [all data]
Baker, Armen, et al., 1981
Baker, A.D.; Armen, G.H.; Guang-di, Y.,
Photoelectron spectra of alkyl aryl selenides. Electronic and steric factors in the observation of rotamers,
J. Org. Chem., 1981, 46, 4127. [all data]
Colonna, Danieli, et al., 1976
Colonna, F.P.; Danieli, R.; Distefano, G.; Ricci, A.,
The electronic effect of XMe3 and CH2XMe3 (X=Si, Ge, Sn, or Pb) substituents in organometallic sulphides. A kinetic and photoelectron spectroscopic study,
J. Chem. Soc. Perkin Trans. 2, 1976, 306. [all data]