Benzene, 1-methoxy-4-methyl-
- Formula: C8H10O
- Molecular weight: 122.1644
- IUPAC Standard InChIKey: CHLICZRVGGXEOD-UHFFFAOYSA-N
- CAS Registry Number: 104-93-8
- Chemical structure:
View 3d structure (requires JavaScript / HTML 5) - Other names: Anisole, p-methyl-; p-Cresol methyl ether; p-Methoxytoluene; p-Methylanisole; p-Tolyl methyl ether; Methyl p-tolyl ether; 1-Methoxy-4-methylbenzene; 4-Methoxytoluene; 4-Methylanisole; p-Cresyl methyl ether; Methyl p-cresyl ether; Methyl 4-methylphenyl ether; 1-Methyl-4-methoxybenzene; 4-Methyl-1-methoxybenzene; 4-Methylphenol methyl ether; Methyl p-methylphenyl ether; 4-Methylmethoxybenzene; para-Methyl anisol; para-Methyl anisole; p-Methylanisol; NSC 6254; 4-Methylanisol

Gas phase thermochemistry data

Data compiled by: Glushko Thermocenter, Russian Academy of Sciences, Moscow
Constant pressure heat capacity of gas
Cp,gas (J/mol*K) | Temperature (K) | Reference | Comment |
---|---|---|---|
52.92 | 100. | Sharma S.N., 1982 | Estimations by difference method [ Dorofeeva O.V., 1997] have reason to suppose that Cp(298.15 K) and S(298.15 K) values obtained by [83SHA3] may be underestimated by 10-25 J/mol*K. |
96.81 | 200. | ||
141.46 | 300. | ||
185.54 | 400. | ||
224.36 | 500. | ||
256.74 | 600. | ||
283.52 | 700. | ||
305.84 | 800. | ||
324.59 | 900. | ||
340.46 | 1000. | ||
353.96 | 1100. | ||
365.48 | 1200. | ||
375.37 | 1300. | ||
383.87 | 1400. | ||
391.22 | 1500. | ||
397.59 | 1600. | ||
403.14 | 1700. | ||
408.00 | 1800. | ||
412.26 | 1900. | ||
416.02 | 2000. |

Phase change data

Data compiled as indicated in comments:
BS - Robert L. Brown and Stephen E. Stein
TRC - Thermodynamics Research Center, NIST Boulder Laboratories, Chris Muzny director
Quantity | Value | Units | Method | Reference | Comment |
---|---|---|---|---|---|
Tboil | 447.2 | K | N/A | Weast and Grasselli, 1989 | BS |
Tboil | 450.9 | K | N/A | Ogimachi, Andrews, et al., 1955 | Uncertainty assigned by TRC = 3. K; TRC |
Tboil | 449.9 | K | N/A | Olson, Hipsher, et al., 1947 | Uncertainty assigned by TRC = 0.5 K; TRC |
Tboil | 449.7 | K | N/A | Boord, Greenlee, et al., 1945 | Uncertainty assigned by TRC = 0.2 K; TRC |
Tboil | 443.75 | K | N/A | Perkin, 1896 | Uncertainty assigned by TRC = 0.5 K; TRC |
Quantity | Value | Units | Method | Reference | Comment |
Tfus | 241.10 | K | N/A | Olson, Hipsher, et al., 1947 | Uncertainty assigned by TRC = 0.3 K; TRC |
Tfus | 241.96 | K | N/A | Boord, Greenlee, et al., 1945 | Uncertainty assigned by TRC = 0.3 K; TRC |
Quantity | Value | Units | Method | Reference | Comment |
Tc | 666. | K | N/A | Young, 1994 | Uncertainty assigned by TRC = 1. K; TRC |

Gas phase ion energetics data

Data evaluated as indicated in comments:
L - Sharon G. Lias
Data compiled as indicated in comments:
MM - Michael M. Meot-Ner (Mautner)
LBLHLM - Sharon G. Lias, John E. Bartmess, Joel F. Liebman, John L. Holmes, Rhoda D. Levin, and W. Gary Mallard
LLK - Sharon G. Lias, Rhoda D. Levin, and Sherif A. Kafafi
RDSH - Henry M. Rosenstock, Keith Draxl, Bruce W. Steiner, and John T. Herron
Quantity | Value | Units | Method | Reference | Comment |
---|---|---|---|---|---|
IE (evaluated) | 7.90 ± 0.05 | eV | N/A | N/A | L |
Proton affinity at 298K
Proton affinity (kJ/mol) | Reference | Comment |
---|---|---|
841. ± 8. | van Beelen, Koblenz, et al., 2004 | T = 298K; PA derived by authors from GB with protonation entropy equated to Rlnσ(B)/σ(BH+); MM |
Gas basicity at 298K
Gas basicity (review) (kJ/mol) | Reference | Comment |
---|---|---|
809. ± 8. | van Beelen, Koblenz, et al., 2004 | T = 298K; PA derived by authors from GB with protonation entropy equated to Rlnσ(B)/σ(BH+); MM |
Ionization energy determinations
IE (eV) | Method | Reference | Comment |
---|---|---|---|
7.90 ± 0.03 | PI | Ponomarev, Arapov, et al., 1986 | LBLHLM |
7.85 | EI | Cooks, Bertrand, et al., 1973 | LLK |
7.91 | CTS | Pitt, Carey, et al., 1972 | LLK |
7.83 | EI | Hoffman and Bursey, 1971 | LLK |
8.3 ± 0.1 | EI | Brown, 1970 | RDSH |
8.0 ± 0.15 | CTS | Voigt and Reid, 1964 | RDSH |
8.14 ± 0.01 | PE | Bernardi, Distefano, et al., 1975 | Vertical value; LLK |
8.18 | PE | Kobayashi and Nagakura, 1974 | Vertical value; LLK |
8.17 | PE | Eaton and Traylor, 1974 | Vertical value; LLK |
8.16 | PE | Dewar, Ernstbrunner, et al., 1974 | Vertical value; LLK |
Appearance energy determinations
Ion | AE (eV) | Other Products | Method | Reference | Comment |
---|---|---|---|---|---|
C6H7+ | 12.9 | ? | EI | Harrison, Haynes, et al., 1965 | RDSH |
C7H7+ | 12.59 | ? | EI | Hoffman and Bursey, 1971 | LLK |
C7H7O+ | 11.36 ± 0.05 | CH3 | PI | Ponomarev, Arapov, et al., 1986 | LBLHLM |
C7H7O+ | 11.5 ± 0.1 | CH3 | EI | Brown, 1970 | RDSH |
C7H7O+ | 10.8 ± 0.1 | CH3 | EI | Tait, Shannon, et al., 1962 | RDSH |
C7H8+ | 11.23 | HCHO | EI | Cooks, Bertrand, et al., 1973 | LLK |
C7H8+ | 11.1 ± 0.1 | CH2O | EI | Brown, 1970 | RDSH |
C8H9O+ | 11.91 | H | EI | Hoffman and Bursey, 1971 | LLK |

Kovats' RI, non-polar column, isothermal

Column type | Active phase | Temperature (C) | I | Reference | Comment |
---|---|---|---|---|---|
Capillary | SE-30 | 100. | 986.6 | Tudor, 1997 | 40. m/0.35 mm/0.35 μm |
Packed | Apiezon L | 100. | 1020. | Bogoslovsky, Anvaer, et al., 1978 | Chromatone N AW DNCS |
Packed | Apiezon L | 150. | 1036. | Bogoslovsky, Anvaer, et al., 1978 | Chromatone N AW DNCS |

Kovats' RI, non-polar column, temperature ramp

Column type | Active phase | I | Reference | Comment |
---|---|---|---|---|
Capillary | CP Sil 5 CB | 1005. | Kasali, Adio, et al., 2002 | He, 3. K/min; Column length: 25. m; Column diameter: 0.25 mm; Tstart: 50. C; Tend: 230. C |
Capillary | OV-101 | 1003. | Gaydou, Randriamiharisoa, et al., 1986 | 100. m/0.3 mm/0.15 μm, H2, 2. K/min; Tstart: 90. C; Tend: 220. C |

Kovats' RI, non-polar column, custom temperature program

Column type | Active phase | I | Reference | Comment |
---|---|---|---|---|
Packed | Apiezon M | 1029.5 | Jalali-Heravi and Garkani-Nejad, 1993 | Chromosorb W; Column length: 2. m; Program: not specified |

Kovats' RI, polar column, isothermal

Column type | Active phase | Temperature (C) | I | Reference | Comment |
---|---|---|---|---|---|
Packed | PEG-20M | 160. | 1461.0 | Still and Whitehead, 1977 | N2, Chromosorb G; Column length: 3. m |
Packed | PEG-20M | 160. | 1461.1 | Still and Whitehead, 1977 | N2, Chromosorb G; Column length: 3. m |

Kovats' RI, polar column, temperature ramp

Column type | Active phase | I | Reference | Comment |
---|---|---|---|---|
Capillary | Supelcowax-10 | 1446. | Wong and Teng, 1994 | He, 35. C @ 5. min, 3. K/min, 200. C @ 20. min; Column length: 60. m; Column diameter: 0.25 mm |
Capillary | Carbowax 20M | 1434. | Gaydou, Randriamiharisoa, et al., 1986 | 50. m/0.3 mm/0.15 μm, H2, 2. K/min; Tstart: 70. C; Tend: 210. C |

Van Den Dool and Kratz RI, non-polar column, temperature ramp

Column type | Active phase | I | Reference | Comment |
---|---|---|---|---|
Capillary | CP Sil 5 CB | 1004. | Ziegenbein, Hanssen, et al., 2006 | H2, 10. K/min; Column length: 25. m; Column diameter: 0.25 mm; Tstart: 80. C; Tend: 270. C |
Capillary | CP Sil 5 CB | 1004. | Ziegenbein, Hanssen, et al., 2006, 2 | 25. m/0.25 mm/0.4 μm, He, 10. K/min; Tstart: 80. C; Tend: 270. C |
Capillary | DB-5 | 1024. | Alves, Pinto, et al., 2005 | 30. m/0.25 mm/0.25 μm, H2, 5. K/min, 270. C @ 20. min; Tstart: 35. C |
Capillary | BP-1 | 1009. | Tam, Thuam, et al., 2004 | 50. m/0.22 mm/0.25 μm, He, 2. K/min, 220. C @ 20. min; Tstart: 60. C |
Capillary | DB-1 | 1015. | Boyom, Assembe, et al., 2003 | 30. m/0.25 mm/0.25 μm, N2, 5. K/min, 200. C @ 0. min; Tstart: 50. C |
Capillary | HP-5MS | 1019. | Demetzos, Angelopoulou, et al., 2002 | 30. m/0.25 mm/0.25 μm, 50. C @ 5. min, 3. K/min; Tend: 280. C |
Capillary | DB-5 | 1026. | Moio, Piombino, et al., 2000 | 30. m/0.32 mm/1. μm, H2, 3. K/min; Tstart: 40. C; Tend: 210. C |
Capillary | DB-5 | 1018. | Isidorov, Zenkevich, et al., 1998 | 30. m/0.25 mm/0.25 μm, 3. K/min; Tstart: 50. C; Tend: 250. C |
Capillary | DB-1 | 1003. | Warthen, Lee, et al., 1997 | 25. m/0.2 mm/0.11 μm, He, 5. K/min; Tstart: 50. C; Tend: 250. C |
Capillary | DB-1 | 1003. | Warthen, Lee, et al., 1997 | 25. m/0.2 mm/0.11 μm, He, 5. K/min; Tstart: 50. C; Tend: 250. C |
Capillary | OV-1 | 999.2 | Gautzsch and Zinn, 1996 | 8. K/min; Tstart: 35. C; Tend: 300. C |
Capillary | DB-1 | 1000. | Stashenko, Prada, et al., 1996 | 60. m/0.25 mm/0.25 μm, He, 50. C @ 5. min, 3.5 K/min; Tend: 250. C |

Van Den Dool and Kratz RI, non-polar column, custom temperature program

Column type | Active phase | I | Reference | Comment |
---|---|---|---|---|
Capillary | 5 % Phenyl methyl siloxane | 1021. | Sacchetti, Maietti, et al., 2005 | 30. m/0.32 mm/0.15 μm, He; Program: 45C => 1C/min => 100C => 5C/min => 250C (10min) |
Capillary | DB-5 | 1020. | Beaulieu and Grimm, 2001 | 30. m/0.25 mm/0.25 μm, He; Program: 50C (1min) => 5C/min => 100C => 10C/min => 250C (9min) |

Van Den Dool and Kratz RI, polar column, temperature ramp

Column type | Active phase | I | Reference | Comment |
---|---|---|---|---|
Capillary | BP-20 | 1430. | Tam, Thuam, et al., 2004 | 50. m/0.22 mm/0.25 μm, He, 2. K/min, 220. C @ 20. min; Tstart: 60. C |
Capillary | DB-Wax | 1446. | Stashenko, Prada, et al., 1996 | 60. m/0.25 mm/0.25 μm, He, 50. C @ 5. min, 2.5 K/min; Tend: 180. C |

Normal alkane RI, non-polar column, temperature ramp

Column type | Active phase | I | Reference | Comment |
---|---|---|---|---|
Capillary | HP-5 MS | 1021. | Nawrath, Mgode, et al., 2012 | 30. m/0.25 mm/0.25 μm, Helium, 50. C @ 5. min, 5. K/min; Tend: 320. C |
Capillary | HP-5 MS | 1016. | Hammami, Kamoun, et al., 2011 | 30. m/0.25 mm/0.25 μm, Helium, 2. K/min; Tstart: 50. C; Tend: 180. C |
Capillary | DB-1 | 989. | Fekam Boyom, Ngouana, et al., 2003 | 30. m/0.25 mm/0.25 μm, N2, 5. K/min; Tstart: 50. C; Tend: 200. C |
Capillary | DB-1 | 994. | Guy and Vernin, 1996 | He, 70. C @ 5. min, 3. K/min; Column length: 30. m; Column diameter: 0.25 mm; Tend: 300. C |
Capillary | DB-1 | 997. | Stashenko, Torres, et al., 1995 | 60. m/0.25 mm/0.25 μm, He, 50. C @ 5. min, 3.5 K/min; Tend: 250. C |
Capillary | OV-101 | 1000. | Egolf and Jurs, 1993 | 2. K/min; Column length: 50. m; Column diameter: 0.22 mm; Tstart: 80. C; Tend: 200. C |
Capillary | Ultra-1 | 1001. | Okumura, 1991 | 25. m/0.32 mm/0.25 μm, He, 3. K/min; Tstart: 80. C; Tend: 260. C |

Normal alkane RI, non-polar column, custom temperature program

Column type | Active phase | I | Reference | Comment |
---|---|---|---|---|
Capillary | DB-5 MS | 1031. | Cajka, Hajslova, et al., 2007 | 30. m/0.25 mm/0.25 μm, Helium; Program: 45 0C (0.75 min) 10 0C/min -> 200 0C 30 0C/min -> 245 0C (1.25 min) |
Capillary | SE-30 | 1005. | Vinogradov, 2004 | Program: not specified |
Capillary | SE-30 | 1000. | Vinogradov, 2004 | Program: not specified |

Normal alkane RI, polar column, temperature ramp

Column type | Active phase | I | Reference | Comment |
---|---|---|---|---|
Capillary | DB-Wax | 1441. | Wei A. and Shibamoto T., 2007 | 60. m/0.25 mm/0.25 μm, He, 60. C @ 8. min, 3. K/min, 180. C @ 80. min |
Capillary | DB-Wax | 1409. | Stashenko, Torres, et al., 1995 | 60. m/0.25 mm/0.25 μm, He, 50. C @ 5. min, 2.5 K/min; Tend: 180. C |
Capillary | Carbowax 20M | 1432. | Egolf and Jurs, 1993 | 2. K/min; Column length: 80. m; Column diameter: 0.2 mm; Tstart: 70. C; Tend: 170. C |

Normal alkane RI, polar column, custom temperature program

Column type | Active phase | I | Reference | Comment |
---|---|---|---|---|
Capillary | Carbowax 20M | 1415. | Vinogradov, 2004 | Program: not specified |
Capillary | Carbowax 20M | 1432. | Vinogradov, 2004 | Program: not specified |

References

Sharma S.N., 1982
Sharma S.N.,
Infrared and laser Raman spectra of m- and p-methylanisoles,
Acta Phys. Pol., 1982, A62, 449-456. [all data]
Dorofeeva O.V., 1997
Dorofeeva O.V.,
Unpublished results. Thermocenter of Russian Academy of Science, Moscow, 1997. [all data]
Weast and Grasselli, 1989
CRC Handbook of Data on Organic Compounds, 2nd Editon, Weast,R.C and Grasselli, J.G., ed(s)., CRC Press, Inc., Boca Raton, FL, 1989, 1. [all data]
Ogimachi, Andrews, et al., 1955
Ogimachi, N.N.; Andrews, L.J.; Keefer, R.M.,
The Free Energies and Heats of Formation of Polyalkoxybenzene-Iodine Monochloride Complexes,
J. Am. Chem. Soc., 1955, 77, 4202. [all data]
Olson, Hipsher, et al., 1947
Olson, W.T.; Hipsher, H.F.; Buess, C.M.; Goodman, I.A.; Hart, I.; Lamneck, J.H.; Gibbons, L.C.,
The Synthesis and Purification of Ethers,
J. Am. Chem. Soc., 1947, 69, 2451-4. [all data]
Boord, Greenlee, et al., 1945
Boord, C.E.; Greenlee, K.W.; Perilstein, W.L.,
, Am. Pet. Inst. Res. Proj. 45, Seventh Annu. Rep., Ohio State Univ., June 30, 1945. [all data]
Perkin, 1896
Perkin, W.H.,
LXIX. On Magnetic Rotatory Power, especially of Aromatic Compounds,
J. Chem. Soc., 1896, 69, 1025-1257. [all data]
Young, 1994
Young, C.L.,
Personal Commun. 1994 1994, 1994. [all data]
van Beelen, Koblenz, et al., 2004
van Beelen, E.S.E.; Koblenz, T.A.; Ingemann, S.; Hammerum, S.,
Experimental and theoretical evaluation of proton affinities of furan, the methylphenols, and the related anisoles,
J. Phys. Chem. A, 2004, 108, 2787. [all data]
Ponomarev, Arapov, et al., 1986
Ponomarev, D.A.; Arapov, O.V.; Sergeev, Y.L.; Chistyakov, A.B.,
[Title unavailable],
Izv. Vyssh. Uchebn. Zaved., Khim. Khim. Tekhnol., 1986, 29, 107. [all data]
Cooks, Bertrand, et al., 1973
Cooks, R.G.; Bertrand, M.; Beynon, J.H.; Rennekamp, M.E.; Setser, D.W.,
Energy partitioning data as an ion structure probe. Substituted anisoles,
J. Am. Chem. Soc., 1973, 95, 1732. [all data]
Pitt, Carey, et al., 1972
Pitt, C.G.; Carey, R.N.; Toren, E.C.,
Nature of the electronic interactions in aryl-substituted polysilanes,
J. Am. Chem. Soc., 1972, 94, 3806. [all data]
Hoffman and Bursey, 1971
Hoffman, M.K.; Bursey, M.M.,
Structural characteristics of non-decomposing C7H7+ ions from some methyl ethers on electron impact,
Chem. Commun., 1971, 824. [all data]
Brown, 1970
Brown, P.,
Kinetic studies in mass spectrometry. VIII. Competing [M-CH3] and [M-CH2O] reactions in substituted anisoles. Approximate activation energies from ionization appearance potentials,
Org. Mass Spectrom., 1970, 4, 519. [all data]
Voigt and Reid, 1964
Voigt, E.M.; Reid, C.,
Ionization potentials of substituted benzenes and their charge-transfer spectra with tetracyanoethylene,
J. Am. Chem. Soc., 1964, 86, 3930. [all data]
Bernardi, Distefano, et al., 1975
Bernardi, F.; Distefano, G.; Mangini, A.; Pignataro, S.; Spunta, G.,
Photoelectron spectra of substituted anisoles thioanisoles,
J. Electron Spectrosc. Relat. Phenom., 1975, 7, 457. [all data]
Kobayashi and Nagakura, 1974
Kobayashi, T.; Nagakura, S.,
Photoelectron spectra of substituted benzenes,
Bull. Chem. Soc. Jpn., 1974, 47, 2563. [all data]
Eaton and Traylor, 1974
Eaton, D.F.; Traylor, T.G.,
Distortional stabilization in phenyl participations,
J. Am. Chem. Soc., 1974, 96, 7109. [all data]
Dewar, Ernstbrunner, et al., 1974
Dewar, P.S.; Ernstbrunner, E.; Gilmore, J.R.; Godfrey, M.; Mellor, J.M.,
Conformational analysis of alkyl aryl ethers and alkyl aryl sulphides by photoelectron spectroscopy,
Tetrahedron, 1974, 30, 2455. [all data]
Harrison, Haynes, et al., 1965
Harrison, A.G.; Haynes, P.; McLean, S.; Meyer, F.,
The mass spectra of methyl-substituted cyclopentadienes,
J. Am. Chem. Soc., 1965, 87, 5099. [all data]
Tait, Shannon, et al., 1962
Tait, J.M.S.; Shannon, T.W.; Harrison, A.G.,
The structure of substituted C7 ions from benzyl derivatives at the appearance potential threshold,
J. Am. Chem. Soc., 1962, 84, 4. [all data]