Benzene, 1-bromo-4-methoxy-
- Formula: C7H7BrO
- Molecular weight: 187.034
- IUPAC Standard InChIKey: QJPJQTDYNZXKQF-UHFFFAOYSA-N
- CAS Registry Number: 104-92-7
- Chemical structure:
View 3d structure (requires JavaScript / HTML 5) - Other names: Anisole, p-bromo-; p-Anisyl bromide; p-Bromanisole; p-Bromoanisole; p-Bromophenyl methyl ether; p-Methoxybromobenzene; p-Methoxyphenyl bromide; Anisyl bromide; 1-Bromo-4-methoxybenzene; 4-Bromoanisole; 4-Methoxy-1-bromobenzene; 4-Methoxybromobenzene; 4-Methoxyphenyl bromide; 4-Bromoanisol; p-Bromoanisol; 4-Anisyl bromide; NSC 8042; p-Bromomethoxybenzene

Phase change data

Data compiled as indicated in comments:
BS - Robert L. Brown and Stephen E. Stein
AC - William E. Acree, Jr., James S. Chickos
Quantity | Value | Units | Method | Reference | Comment |
---|---|---|---|---|---|
Tboil | 496.2 | K | N/A | Aldrich Chemical Company Inc., 1990 | BS |
Tboil | 488.2 | K | N/A | Weast and Grasselli, 1989 | BS |
Quantity | Value | Units | Method | Reference | Comment |
ΔvapH° | 58.3 ± 1.2 | kJ/mol | C | Ribeiro da Silva and Lobo Ferreira, 2009 | AC |
Enthalpy of vaporization
ΔvapH (kJ/mol) | Temperature (K) | Reference | Comment |
---|---|---|---|
48.9 | 333. | Stull, 1947 | Based on data from 318. to 496. K.; AC |
Antoine Equation Parameters
log10(P) = A − (B / (T + C))
P = vapor pressure (bar)
T = temperature (K)
View plot Requires a JavaScript / HTML 5 canvas capable browser.
Temperature (K) | A | B | C | Reference | Comment |
---|---|---|---|---|---|
317.9 to 496. | 5.38413 | 2722.26 | 10.592 | Stull, 1947 | Coefficents calculated by NIST from author's data. |

Gas phase ion energetics data

Data evaluated as indicated in comments:
L - Sharon G. Lias
Data compiled as indicated in comments:
LBLHLM - Sharon G. Lias, John E. Bartmess, Joel F. Liebman, John L. Holmes, Rhoda D. Levin, and W. Gary Mallard
LLK - Sharon G. Lias, Rhoda D. Levin, and Sherif A. Kafafi
RDSH - Henry M. Rosenstock, Keith Draxl, Bruce W. Steiner, and John T. Herron
Quantity | Value | Units | Method | Reference | Comment |
---|---|---|---|---|---|
IE (evaluated) | 8.13 ± 0.02 | eV | N/A | N/A | L |
Ionization energy determinations
IE (eV) | Method | Reference | Comment |
---|---|---|---|
8.14 ± 0.03 | PI | Ponomarev, Arapov, et al., 1986 | LBLHLM |
8.11 | PE | Behan, Johnstone, et al., 1976 | LLK |
8.4 ± 0.1 | EI | Brown, 1970 | RDSH |
8.2 ± 0.15 | CTS | Voigt and Reid, 1964 | RDSH |
8.49 | PE | Baker, May, et al., 1968 | Vertical value; RDSH |
Appearance energy determinations
Ion | AE (eV) | Other Products | Method | Reference | Comment |
---|---|---|---|---|---|
C6H4BrO+ | 11.88 ± 0.05 | CH3 | PI | Ponomarev, Arapov, et al., 1986 | LBLHLM |
C6H4BrO+ | 11.9 ± 0.1 | CH3 | EI | Brown, 1970 | RDSH |
C6H4OBr+ | 11.80 | CH3 | EI | Howe and Williams, 1969 | RDSH |
C6H4OBr+ | 11.8 ± 0.1 | CH3 | EI | Tait, Shannon, et al., 1962 | RDSH |
C6H5Br+ | 11.5 ± 0.1 | CH2O | EI | Brown, 1970 | RDSH |

Kovats' RI, non-polar column, isothermal

Column type | Active phase | Temperature (C) | I | Reference | Comment |
---|---|---|---|---|---|
Packed | Apolane | 150. | 1212. | Evans and Haken, 1987 | He, Chromosorb G AW DCMS; Column length: 3.7 m |
Packed | Apolane | 150. | 1212. | Haken and Vernon, 1986 | Chromosorb G AW DCMS; Column length: 3.7 m |
Packed | Apiezon L | 130. | 1224. | Cook and Raushel, 1972 | He, Chromosorb W AW DMCS (80-100 mesh) |

Kovats' RI, polar column, isothermal

Column type | Active phase | Temperature (C) | I | Reference | Comment |
---|---|---|---|---|---|
Packed | Carbowax 20M | 150. | 1706. | Haken and Vernon, 1986 | Chromosorb G AW DCMS; Column length: 3.7 m; Column diameter: 6.4 mm |

Van Den Dool and Kratz RI, non-polar column, custom temperature program

Column type | Active phase | I | Reference | Comment |
---|---|---|---|---|
Capillary | VF-5MS | 1212.7 | Tret'yakov, 2007 | 30. m/0.25 mm/0.25 μm, He; Program: Multi-step temperature program; T(initial)=60C; T(final)=270C |

References

Aldrich Chemical Company Inc., 1990
Aldrich Chemical Company Inc.,
Catalog Handbook of Fine Chemicals, Aldrich Chemical Company, Inc., Milwaukee WI, 1990, 1. [all data]
Weast and Grasselli, 1989
CRC Handbook of Data on Organic Compounds, 2nd Editon, Weast,R.C and Grasselli, J.G., ed(s)., CRC Press, Inc., Boca Raton, FL, 1989, 1. [all data]
Ribeiro da Silva and Lobo Ferreira, 2009
Ribeiro da Silva, Manuel A.V.; Lobo Ferreira, Ana I.M.C.,
Experimental and computational study on the molecular energetics of monobromoanisole isomers,
The Journal of Chemical Thermodynamics, 2009, 41, 4, 499-505, https://doi.org/10.1016/j.jct.2008.11.008
. [all data]
Stull, 1947
Stull, Daniel R.,
Vapor Pressure of Pure Substances. Organic and Inorganic Compounds,
Ind. Eng. Chem., 1947, 39, 4, 517-540, https://doi.org/10.1021/ie50448a022
. [all data]
Ponomarev, Arapov, et al., 1986
Ponomarev, D.A.; Arapov, O.V.; Sergeev, Y.L.; Chistyakov, A.B.,
[Title unavailable],
Izv. Vyssh. Uchebn. Zaved., Khim. Khim. Tekhnol., 1986, 29, 107. [all data]
Behan, Johnstone, et al., 1976
Behan, J.M.; Johnstone, R.A.W.; Bentley, T.W.,
An evaluation of empirical methods for calculating the ionization potentials of substituted benzenes,
Org. Mass Spectrom., 1976, 11, 207. [all data]
Brown, 1970
Brown, P.,
Kinetic studies in mass spectrometry. VIII. Competing [M-CH3] and [M-CH2O] reactions in substituted anisoles. Approximate activation energies from ionization appearance potentials,
Org. Mass Spectrom., 1970, 4, 519. [all data]
Voigt and Reid, 1964
Voigt, E.M.; Reid, C.,
Ionization potentials of substituted benzenes and their charge-transfer spectra with tetracyanoethylene,
J. Am. Chem. Soc., 1964, 86, 3930. [all data]
Baker, May, et al., 1968
Baker, A.D.; May, D.P.; Turner, D.W.,
Molecular photoelectron spectroscopy. Part VII. The vertical ionisation potentials of benzene and some of its monosubstituted and 1,4-disubstituted derivatives,
J. Chem. Soc. B, 1968, 22. [all data]
Howe and Williams, 1969
Howe, I.; Williams, D.H.,
Calculation and qualitative predictions of mass spectra. Mono- and paradisubstituted benzenes,
J. Am. Chem. Soc., 1969, 91, 7137. [all data]
Tait, Shannon, et al., 1962
Tait, J.M.S.; Shannon, T.W.; Harrison, A.G.,
The structure of substituted C7 ions from benzyl derivatives at the appearance potential threshold,
J. Am. Chem. Soc., 1962, 84, 4. [all data]