1-Phenylcyclopentanol-1
- Formula: C11H14O
- Molecular weight: 162.2283
- IUPAC Standard InChIKey: ITHZGJVAQFFNCZ-UHFFFAOYSA-N
- CAS Registry Number: 10487-96-4
- Chemical structure:
View 3d structure (requires JavaScript / HTML 5) - Other names: Cyclopentanol, 1-phenyl-; 1-Phenylcyclopentanol; Benzene, cyclopent-1-yl-1-ol-

Phase change data

Data compiled by: Robert L. Brown and Stephen E. Stein
Reduced pressure boiling point
Tboil (K) | Pressure (bar) | Reference |
---|---|---|
405.7 | 0.024 | Weast and Grasselli, 1989 |

Gas phase ion energetics data

Data compiled by: Sharon G. Lias, Rhoda D. Levin, and Sherif A. Kafafi
Ionization energy determinations
IE (eV) | Method | Reference |
---|---|---|
8.0 | EI | Mikaya, Zaikin, et al., 1979 |
Appearance energy determinations
Ion | AE (eV) | Other Products | Method | Reference | Comment |
---|---|---|---|---|---|
C8H8O+ | 9.3 | C3H6 | EI | Mikaya, Zaikin, et al., 1979 |

References

Weast and Grasselli, 1989
CRC Handbook of Data on Organic Compounds, 2nd Editon, Weast,R.C and Grasselli, J.G., ed(s)., CRC Press, Inc., Boca Raton, FL, 1989, 1. [all data]
Mikaya, Zaikin, et al., 1979
Mikaya, A.I.; Zaikin, V.G.; Finkel'stein, E.S.; Vdovin, V.M.,
Mass-spectrometric investigation of aromatic derivatives of cycloalkanes and cycloalkanols,
Izv. Akad. Nauk SSSR, Ser. Khim., 1979, 10, 2221. [all data]