Azulene,1,3-diacetyl-
- Formula: C14H12O2
- Molecular weight: 212.2439
- IUPAC Standard InChIKey: OOMBQAKQCAZTQJ-UHFFFAOYSA-N
- CAS Registry Number: 10487-55-5
- Chemical structure:
View 3d structure (requires JavaScript / HTML 5) - Permanent link for this species. Use this link for bookmarking this species for future reference.

Gas phase ion energetics data

Data compiled by: Sharon G. Lias, Rhoda D. Levin, and Sherif A. Kafafi
Ionization energy determinations
IE (eV) | Method | Reference | Comment |
---|---|---|---|
7.95 | PE | Dougherty, Lewis, et al., 1980 | Vertical value |

References

Dougherty, Lewis, et al., 1980
Dougherty, D.; Lewis, J.; Nauman, R.V.; McGlynn, S.P.,
Photoelectron spectroscopy of azulenes,
J. Electron Spectrosc. Relat. Phenom., 1980, 19, 21. [all data]
Heilbronner and Gerdil, 1956
Heilbronner, E.; Gerdil, R.,
Helv. Chim. Acta, 1956, 39, 1996. [all data]