3-Iodothiophene
- Formula: C4H3IS
- Molecular weight: 210.036
- IUPAC Standard InChIKey: WGKRMQIQXMJVFZ-UHFFFAOYSA-N
- CAS Registry Number: 10486-61-0
- Chemical structure:
View 3d structure (requires JavaScript / HTML 5) - Other names: Thiophene, 3-iodo-

Phase change data

Data compiled by: Robert L. Brown and Stephen E. Stein
Reduced pressure boiling point
Tboil (K) | Pressure (bar) | Reference |
---|---|---|
350.2 | 0.015 | Weast and Grasselli, 1989 |

Gas phase ion energetics data

Data compiled as indicated in comments:
LLK - Sharon G. Lias, Rhoda D. Levin, and Sherif A. Kafafi
Ionization energy determinations
IE (eV) | Method | Reference | Comment |
---|---|---|---|
8.46 | PE | Bozic, Humski, et al., 1977 | Vertical value; LLK |

References

Weast and Grasselli, 1989
CRC Handbook of Data on Organic Compounds, 2nd Editon, Weast,R.C and Grasselli, J.G., ed(s)., CRC Press, Inc., Boca Raton, FL, 1989, 1. [all data]
Bozic, Humski, et al., 1977
Bozic, Z.; Humski, K.; Cvitas, T.; Klasinc, L.,
Photoelectron spectra of bromo- and iodo- thiophens,
J. Chem. Soc. Perkin Trans. 2, 1977, 1413. [all data]