Benzene, 1-(chloromethyl)-4-methyl-
- Formula: C8H9Cl
- Molecular weight: 140.610
- IUPAC Standard InChIKey: DMHZDOTYAVHSEH-UHFFFAOYSA-N
- CAS Registry Number: 104-82-5
- Chemical structure:
View 3d structure (requires JavaScript / HTML 5) - Isotopologues:
- Other names: p-Xylene, α-chloro-; α-Chloro-p-xylene; p-Chloromethyltoluene; p-Methylbenzyl chloride; p-Xylyl chloride; p-Xylyl-α-chloride; 1-(Chloromethyl)-4-methylbenzene; 4-Methylbenzyl chloride; 1-Methyl-4-(chloromethyl)benzene; 4-(Chloromethyl)toluene; p-Xylene, alpha-chloro-; (4-Methylphenyl)methyl chloride; NSC 46590; p-Tolylmethyl chloride

Reaction thermochemistry data

Data compiled by: John E. Bartmess
Individual Reactions
C8H8Cl- + =
By formula: C8H8Cl- + H+ = C8H9Cl
Quantity | Value | Units | Method | Reference | Comment |
---|---|---|---|---|---|
ΔrH° | 375.1 ± 2.3 | kcal/mol | D-EA | Hammad and Wenthold, 2000 | gas phase |
Quantity | Value | Units | Method | Reference | Comment |
ΔrG° | 367.9 ± 2.4 | kcal/mol | H-TS | Hammad and Wenthold, 2000 | gas phase |

Gas phase ion energetics data

Data compiled as indicated in comments:
B - John E. Bartmess
LLK - Sharon G. Lias, Rhoda D. Levin, and Sherif A. Kafafi
Ionization energy determinations
IE (eV) | Method | Reference | Comment |
---|---|---|---|
8.79 ± 0.03 | PI | Ponomarev, Takhimova, et al., 1974 | LLK |
De-protonation reactions
C8H8Cl- + =
By formula: C8H8Cl- + H+ = C8H9Cl
Quantity | Value | Units | Method | Reference | Comment |
---|---|---|---|---|---|
ΔrH° | 375.1 ± 2.3 | kcal/mol | D-EA | Hammad and Wenthold, 2000 | gas phase; B |
Quantity | Value | Units | Method | Reference | Comment |
ΔrG° | 367.9 ± 2.4 | kcal/mol | H-TS | Hammad and Wenthold, 2000 | gas phase; B |

References

Hammad and Wenthold, 2000
Hammad, L.A.; Wenthold, P.G.,
Synthesis, characterization, and reactivity of the m-xylylene anion in the gas phase. The enthalpy of formation of m-xylylene,
J. Am. Chem. Soc., 2000, 122, 45, 11203-11211, https://doi.org/10.1021/ja002138n
. [all data]
Ponomarev, Takhimova, et al., 1974
Ponomarev, D.A.; Takhimova, V.V.; Akopyan, M.E.; Sergeyev, Y.L.,
Effect of alkyl groups on the stability of cations in the absence of solvation effects,
Zh. Org. Khim., 1974, 10, 403. [all data]