Benzene, 1-(bromomethyl)-4-methyl-
- Formula: C8H9Br
- Molecular weight: 185.061
- IUPAC Standard InChIKey: WZRKSPFYXUXINF-UHFFFAOYSA-N
- CAS Registry Number: 104-81-4
- Chemical structure:
View 3d structure (requires JavaScript / HTML 5) - Other names: p-Xylene, α-bromo-; α-Bromo-p-xylene; α-Bromo-p-xylol; p-Methylbenzyl bromide; p-Xylyl bromide; p-Xylyl-α-bromide; 1-(Bromomethyl)-4-methylbenzene; 4-Methylbenzyl bromide; 4-(Bromomethyl)toluene; NSC 8050; p-(Bromomethyl)toluene

Phase change data

Data compiled as indicated in comments:
BS - Robert L. Brown and Stephen E. Stein
TRC - Thermodynamics Research Center, NIST Boulder Laboratories, Chris Muzny director
Quantity | Value | Units | Method | Reference | Comment |
---|---|---|---|---|---|
Tboil | 492.2 | K | N/A | Aldrich Chemical Company Inc., 1990 | BS |
Quantity | Value | Units | Method | Reference | Comment |
Tfus | 307.15 | K | N/A | Mitchell and Vivekanantan, 1989 | Uncertainty assigned by TRC = 1.5 K; TRC |
Reduced pressure boiling point
Tboil (K) | Pressure (bar) | Reference | Comment |
---|---|---|---|
492.2 | 0.987 | Weast and Grasselli, 1989 | BS |

Gas phase ion energetics data

Data compiled by: Henry M. Rosenstock, Keith Draxl, Bruce W. Steiner, and John T. Herron
Appearance energy determinations
Ion | AE (eV) | Other Products | Method | Reference | Comment |
---|---|---|---|---|---|
C8H9+ | 9.4 ± 0.1 | Br | EI | Tait, Shannon, et al., 1962 |

References

Aldrich Chemical Company Inc., 1990
Aldrich Chemical Company Inc.,
Catalog Handbook of Fine Chemicals, Aldrich Chemical Company, Inc., Milwaukee WI, 1990, 1. [all data]
Mitchell and Vivekanantan, 1989
Mitchell, R.H.; Vivekanantan, S.I.,
Accounts Rapid Comm. Synth. Org. Chem., 1989, No. 1, 54. [all data]
Weast and Grasselli, 1989
CRC Handbook of Data on Organic Compounds, 2nd Editon, Weast,R.C and Grasselli, J.G., ed(s)., CRC Press, Inc., Boca Raton, FL, 1989, 1. [all data]
Tait, Shannon, et al., 1962
Tait, J.M.S.; Shannon, T.W.; Harrison, A.G.,
The structure of substituted C7 ions from benzyl derivatives at the appearance potential threshold,
J. Am. Chem. Soc., 1962, 84, 4. [all data]