Germane, tetraphenyl-
- Formula: C24H20Ge
- Molecular weight: 381.06
- IUPAC Standard InChIKey: ILEXMONMGUVLRM-UHFFFAOYSA-N
- CAS Registry Number: 1048-05-1
- Chemical structure:
View 3d structure (requires JavaScript / HTML 5) - Other names: Tetraphenylgermane; Tetraphenylgermanium

Gas phase thermochemistry data

Data compiled by: José A. Martinho Simões
Quantity | Value | Units | Method | Reference | Comment |
---|---|---|---|---|---|
ΔfH°gas | 438. ± 15. | kJ/mol | Review | Martinho Simões | Selected data |
ΔfH°gas | 1028.0 ± 7.0 | kJ/mol | Review | Martinho Simões | |
ΔfH°gas | 602. ± 10. | kJ/mol | Review | Martinho Simões |

Condensed phase thermochemistry data

Data compiled by: José A. Martinho Simões
Quantity | Value | Units | Method | Reference | Comment |
---|---|---|---|---|---|
ΔfH°solid | 281. ± 14. | kJ/mol | Review | Martinho Simões | Selected data |
ΔfH°solid | 871.1 ± 5.6 | kJ/mol | Review | Martinho Simões | |
ΔfH°solid | 444.8 ± 9.2 | kJ/mol | Review | Martinho Simões | |
Quantity | Value | Units | Method | Reference | Comment |
ΔcH°solid | -13286.3 ± 8.4 | kJ/mol | CC-SB | Shaulov, Fedorov, et al., 1970 | |
ΔcH°solid | -13139. ± 14. | kJ/mol | CC-RB | Adams, Carson, et al., 1969 | Please also see Pedley and Rylance, 1977. |
ΔcH°solid | -13712.6 ± 4.2 | kJ/mol | CC-SB | Birr, 1962 |

Phase change data

Data compiled as indicated in comments:
AC - William E. Acree, Jr., James S. Chickos
MS - José A. Martinho Simões
Quantity | Value | Units | Method | Reference | Comment |
---|---|---|---|---|---|
ΔsubH° | 156.9 ± 4.2 | kJ/mol | N/A | Pilcher and Skinner, 1983 | See also Adams, Carson, et al., 1969.; AC |
ΔsubH° | 168.6 ± 8.4 | kJ/mol | N/A | Pilcher and Skinner, 1983 | See also Carson, Carson, et al., 1970.; AC |
ΔsubH° | 156.9 ± 4.2 | kJ/mol | CC-RB | Kana'an, 1974 | MS |
Enthalpy of sublimation
ΔsubH (kJ/mol) | Temperature (K) | Method | Reference | Comment |
---|---|---|---|---|
148.6 | 441. | A | Stephenson and Malanowski, 1987 | Based on data from 402. to 480. K.; AC |

Gas phase ion energetics data

Data compiled as indicated in comments:
LBLHLM - Sharon G. Lias, John E. Bartmess, Joel F. Liebman, John L. Holmes, Rhoda D. Levin, and W. Gary Mallard
Ionization energy determinations
IE (eV) | Method | Reference | Comment |
---|---|---|---|
8.1 | PE | Novak and Potts, 1984 | LBLHLM |
8.95 | PE | Novak and Potts, 1984 | Vertical value; LBLHLM |

References

Martinho Simões
Martinho Simões, J.A.,
Private communication (see http://webbook.nist.gov/chemistry/om/). [all data]
Shaulov, Fedorov, et al., 1970
Shaulov, Yu.Kh.; Fedorov, A.K.; Genchel, V.G.,
Russ. J. Phys. Chem., 1970, 44, 146. [all data]
Adams, Carson, et al., 1969
Adams, G.P.; Carson, A.S.; Laye, P.G.,
Heats of combustion of organo-metallic compounds using a vacuum-jacketed, rotating, aneroid calorimeter. Heat of formation of germanium tetraphenyl,
Trans. Faraday Soc., 1969, 65, 113, https://doi.org/10.1039/tf9696500113
. [all data]
Pedley and Rylance, 1977
Pedley, J.B.; Rylance, J.,
Computer Analysed Thermochemical Data: Organic and Organometallic Compounds, University of Sussex, Brigton, 1977. [all data]
Birr, 1962
Birr, K.-H.,
Z. Anorg. Allg. Chem., 1962, 315, 175. [all data]
Pilcher and Skinner, 1983
Pilcher, G.; Skinner, H.A.,
Thermochemistry of organometallic compounds, 1983, 43-90, https://doi.org/10.1002/9780470771686.ch2
. [all data]
Carson, Carson, et al., 1970
Carson, A.S.; Carson, E.M.; Laye, P.G.; Spencer, J.A.; Steele, W.V.,
Enthalpy of combustion of organo-metallic compounds measured with a vacuum-jacketed, rotating, aneroid calorimeter. The enthalpies of formation of germanium tetrabenzyl and di-germanium hexaphenyl,
Trans. Faraday Soc., 1970, 66, 2459, https://doi.org/10.1039/tf9706602459
. [all data]
Kana'an, 1974
Kana'an, A.S.,
J. Chem. Thermodyn., 1974, 6, 191. [all data]
Stephenson and Malanowski, 1987
Stephenson, Richard M.; Malanowski, Stanislaw,
Handbook of the Thermodynamics of Organic Compounds, 1987, https://doi.org/10.1007/978-94-009-3173-2
. [all data]
Novak and Potts, 1984
Novak, I.; Potts, A.W.,
The UV gas-phase photoelectron spectra of Group IVB tetraphenyl derivatives,
J. Organomet. Chem., 1984, 262, 17. [all data]