strontium iodide
- Formula: I2Sr
- Molecular weight: 341.43
- CAS Registry Number: 10476-86-5

Condensed phase thermochemistry data

Quantity | Value | Units | Method | Reference | Comment |
---|---|---|---|---|---|
ΔfH°liquid | -548.75 | kJ/mol | Review | Chase, 1998 | Data last reviewed in June, 1974 |
Quantity | Value | Units | Method | Reference | Comment |
S°liquid,1 bar | 172.42 | J/mol*K | Review | Chase, 1998 | Data last reviewed in June, 1974 |
Quantity | Value | Units | Method | Reference | Comment |
ΔfH°solid | -561.49 | kJ/mol | Review | Chase, 1998 | Data last reviewed in June, 1974 |
Quantity | Value | Units | Method | Reference | Comment |
S°solid | 159.12 | J/mol*K | Review | Chase, 1998 | Data last reviewed in June, 1974 |
Liquid Phase Heat Capacity (Shomate Equation)
Cp° = A + B*t + C*t2 + D*t3 +
E/t2
H° − H°298.15= A*t + B*t2/2 +
C*t3/3 + D*t4/4 − E/t + F − H
S° = A*ln(t) + B*t + C*t2/2 + D*t3/3 −
E/(2*t2) + G
Cp = heat capacity (J/mol*K)
H° = standard enthalpy (kJ/mol)
S° = standard entropy (J/mol*K)
t = temperature (K) / 1000.
View plot Requires a JavaScript / HTML 5 canvas capable browser.
Temperature (K) | 811. to 2600. |
---|---|
A | 110.0392 |
B | -1.922767×10-8 |
C | 1.090435×10-8 |
D | -2.008262×10-9 |
E | -1.106082×10-9 |
F | -587.4713 |
G | 290.3315 |
H | -548.7483 |
Reference | Chase, 1998 |
Comment | Data last reviewed in June, 1974 |
Solid Phase Heat Capacity (Shomate Equation)
Cp° = A + B*t + C*t2 + D*t3 +
E/t2
H° − H°298.15= A*t + B*t2/2 +
C*t3/3 + D*t4/4 − E/t + F − H
S° = A*ln(t) + B*t + C*t2/2 + D*t3/3 −
E/(2*t2) + G
Cp = heat capacity (J/mol*K)
H° = standard enthalpy (kJ/mol)
S° = standard entropy (J/mol*K)
t = temperature (K) / 1000.
View plot Requires a JavaScript / HTML 5 canvas capable browser.
Temperature (K) | 298. to 811. |
---|---|
A | 69.77992 |
B | 27.49888 |
C | -0.072715 |
D | 0.032339 |
E | -0.000958 |
F | -583.5216 |
G | 235.3642 |
H | -561.4928 |
Reference | Chase, 1998 |
Comment | Data last reviewed in June, 1974 |

Gas phase ion energetics data

Data compiled as indicated in comments:
LBLHLM - Sharon G. Lias, John E. Bartmess, Joel F. Liebman, John L. Holmes, Rhoda D. Levin, and W. Gary Mallard
LLK - Sharon G. Lias, Rhoda D. Levin, and Sherif A. Kafafi
Ionization energy determinations
IE (eV) | Method | Reference | Comment |
---|---|---|---|
9.1 | S | Emons, Kiessling, et al., 1982 | LBLHLM |
8.3 | PE | Lee and Potts, 1979 | LLK |
9.01 ± 0.01 | PE | Lee and Potts, 1979 | Vertical value; LLK |
10.0 | PE | Hammer, Allen, et al., 1978 | Vertical value; LLK |
Appearance energy determinations
Ion | AE (eV) | Other Products | Method | Reference | Comment |
---|---|---|---|---|---|
ISr+ | 9.5 | I | S | Emons, Kiessling, et al., 1982 | LBLHLM |
SrI+ | 9.5 ± 0.3 | I | EI | Kleinschmidt and Hildenbrand, 1978 | LLK |
Sr+ | 14.1 | I2 | S | Emons, Kiessling, et al., 1982 | LBLHLM |

References

Chase, 1998
Chase, M.W., Jr.,
NIST-JANAF Themochemical Tables, Fourth Edition,
J. Phys. Chem. Ref. Data, Monograph 9, 1998, 1-1951. [all data]
Emons, Kiessling, et al., 1982
Emons, H.-H.; Kiessling, D.; Horlbeck, W.,
Dampfdruckmessungen und massenspektrometrische untersuchungen der gasphase uber erdalkalimetallhalogeniden,
Z. Anorg. Allg. Chem., 1982, 488, 219. [all data]
Lee and Potts, 1979
Lee, E.P.F.; Potts, A.W.,
An investigation of the valence shell electronic structure of alkaline earth halides by using Ab initio S. C. F. calculations and photoelectron spectroscopy,
Proc. R. Soc. London A:, 1979, 365, 395. [all data]
Hammer, Allen, et al., 1978
Hammer, C.A.; Allen, J.D., Jr.; Cusachs, L.C.; Schweitzer, G.K.,
The high-temperature photoelectron spectra of alkaline-earth chlorides and iodides,
J. Electron Spectrosc. Relat. Phenom., 1978, 13, 149. [all data]
Kleinschmidt and Hildenbrand, 1978
Kleinschmidt, P.D.; Hildenbrand, D.L.,
Dissociation energies of CaI, SrI, and BaI from high temperature mass spectrometry,
J. Chem. Phys., 1978, 68, 2819. [all data]