strontium chloride
- Formula: Cl2Sr
- Molecular weight: 158.53
- CAS Registry Number: 10476-85-4

Condensed phase thermochemistry data

Quantity | Value | Units | Method | Reference | Comment |
---|---|---|---|---|---|
ΔfH°liquid | -805.35 | kJ/mol | Review | Chase, 1998 | Data last reviewed in December, 1972 |
Quantity | Value | Units | Method | Reference | Comment |
S°liquid,1 bar | 135.82 | J/mol*K | Review | Chase, 1998 | Data last reviewed in December, 1972 |
Quantity | Value | Units | Method | Reference | Comment |
ΔfH°solid | -828.85 | kJ/mol | Review | Chase, 1998 | Data last reviewed in December, 1972 |
Quantity | Value | Units | Method | Reference | Comment |
S°solid | 114.81 | J/mol*K | Review | Chase, 1998 | Data last reviewed in December, 1972 |
Liquid Phase Heat Capacity (Shomate Equation)
Cp° = A + B*t + C*t2 + D*t3 +
E/t2
H° − H°298.15= A*t + B*t2/2 +
C*t3/3 + D*t4/4 − E/t + F − H
S° = A*ln(t) + B*t + C*t2/2 + D*t3/3 −
E/(2*t2) + G
Cp = heat capacity (J/mol*K)
H° = standard enthalpy (kJ/mol)
S° = standard entropy (J/mol*K)
t = temperature (K) / 1000.
View plot Requires a JavaScript / HTML 5 canvas capable browser.
Temperature (K) | 1147. to 3000. |
---|---|
A | 104.6000 |
B | 4.193874×10-8 |
C | -1.833062×10-8 |
D | 2.682757×10-9 |
E | 6.966110×10-9 |
F | -847.5361 |
G | 239.6884 |
H | -805.3531 |
Reference | Chase, 1998 |
Comment | Data last reviewed in December, 1972 |
Solid Phase Heat Capacity (Shomate Equation)
Cp° = A + B*t + C*t2 + D*t3 +
E/t2
H° − H°298.15= A*t + B*t2/2 +
C*t3/3 + D*t4/4 − E/t + F − H
S° = A*ln(t) + B*t + C*t2/2 + D*t3/3 −
E/(2*t2) + G
Cp = heat capacity (J/mol*K)
H° = standard enthalpy (kJ/mol)
S° = standard entropy (J/mol*K)
t = temperature (K) / 1000.
View plot Requires a JavaScript / HTML 5 canvas capable browser.
Temperature (K) | 298. to 1000. | 1000. to 1147. |
---|---|---|
A | 54.42882 | 123.0100 |
B | 113.7676 | -0.000006 |
C | -177.4497 | 0.000003 |
D | 115.0826 | -5.560327×10-7 |
E | -0.003286 | -8.034954×10-7 |
F | -848.8081 | -884.8742 |
G | 153.6084 | 223.0210 |
H | -828.8504 | -828.8504 |
Reference | Chase, 1998 | Chase, 1998 |
Comment | Data last reviewed in December, 1972 | Data last reviewed in December, 1972 |

Phase change data

Data compiled as indicated in comments:
TRC - Thermodynamics Research Center, NIST Boulder Laboratories, Chris Muzny director
AC - William E. Acree, Jr., James S. Chickos
Quantity | Value | Units | Method | Reference | Comment |
---|---|---|---|---|---|
Tfus | 1146. | K | N/A | Dworkin and Bredig, 1963 | Uncertainty assigned by TRC = 2. K; TRC |
Quantity | Value | Units | Method | Reference | Comment |
ΔsubH° | 328.9 ± 4.8 | kJ/mol | LE | Loehman, Kent, et al., 1965 | AC |

Gas phase ion energetics data

Data compiled as indicated in comments:
LBLHLM - Sharon G. Lias, John E. Bartmess, Joel F. Liebman, John L. Holmes, Rhoda D. Levin, and W. Gary Mallard
LLK - Sharon G. Lias, Rhoda D. Levin, and Sherif A. Kafafi
RDSH - Henry M. Rosenstock, Keith Draxl, Bruce W. Steiner, and John T. Herron
Ionization energy determinations
IE (eV) | Method | Reference | Comment |
---|---|---|---|
9.8 | S | Emons, Kiessling, et al., 1982 | LBLHLM |
10.49 ± 0.04 | PE | Lee and Potts, 1979 | LLK |
9.70 ± 0.10 | EI | Hildenbrand, 1970 | RDSH |
10.5 ± 1.0 | EI | Hildenbrand, 1970, 2 | RDSH |
10.2 | PE | Hammer, Allen, et al., 1978 | Vertical value; LLK |
Appearance energy determinations
Ion | AE (eV) | Other Products | Method | Reference | Comment |
---|---|---|---|---|---|
ClSr+ | 10.2 | Cl | S | Emons, Kiessling, et al., 1982 | LBLHLM |
SrCl+ | 10.48 ± 0.10 | Cl | EI | Hildenbrand, 1970 | RDSH |
SrCl+ | 10.7 ± 0.3 | Cl | EI | Hildenbrand, 1970, 2 | RDSH |
Sr+ | 14.6 | Cl2 | S | Emons, Kiessling, et al., 1982 | LBLHLM |

Gas phase thermochemistry data

Quantity | Value | Units | Method | Reference | Comment |
---|---|---|---|---|---|
ΔfH°gas | -473.21 | kJ/mol | Review | Chase, 1998 | Data last reviewed in December, 1972 |
Quantity | Value | Units | Method | Reference | Comment |
S°gas,1 bar | 316.34 | J/mol*K | Review | Chase, 1998 | Data last reviewed in December, 1972 |
Gas Phase Heat Capacity (Shomate Equation)
Cp° = A + B*t + C*t2 + D*t3 +
E/t2
H° − H°298.15= A*t + B*t2/2 +
C*t3/3 + D*t4/4 − E/t + F − H
S° = A*ln(t) + B*t + C*t2/2 + D*t3/3 −
E/(2*t2) + G
Cp = heat capacity (J/mol*K)
H° = standard enthalpy (kJ/mol)
S° = standard entropy (J/mol*K)
t = temperature (K) / 1000.
View plot Requires a JavaScript / HTML 5 canvas capable browser.
Temperature (K) | 3000. to 6000. |
---|---|
A | 58.10781 |
B | 0.079950 |
C | -0.021715 |
D | 0.001855 |
E | -0.210803 |
F | -491.2476 |
G | 385.4468 |
H | -473.2104 |
Reference | Chase, 1998 |
Comment | Data last reviewed in December, 1972 |

References

Chase, 1998
Chase, M.W., Jr.,
NIST-JANAF Themochemical Tables, Fourth Edition,
J. Phys. Chem. Ref. Data, Monograph 9, 1998, 1-1951. [all data]
Dworkin and Bredig, 1963
Dworkin, A.S.; Bredig, M.A.,
Heat Content and Entropy or Strontium CHloride from 298 to 1200 K,
J. Chem. Eng. Data, 1963, 8, 416-7. [all data]
Loehman, Kent, et al., 1965
Loehman, R.E.; Kent, R.A.; Margrave, J.L.,
Vaporization and Sublimation of SrCl 2 .,
J. Chem. Eng. Data, 1965, 10, 3, 296-297, https://doi.org/10.1021/je60026a028
. [all data]
Emons, Kiessling, et al., 1982
Emons, H.-H.; Kiessling, D.; Horlbeck, W.,
Dampfdruckmessungen und massenspektrometrische untersuchungen der gasphase uber erdalkalimetallhalogeniden,
Z. Anorg. Allg. Chem., 1982, 488, 219. [all data]
Lee and Potts, 1979
Lee, E.P.F.; Potts, A.W.,
An investigation of the valence shell electronic structure of alkaline earth halides by using Ab initio S. C. F. calculations and photoelectron spectroscopy,
Proc. R. Soc. London A:, 1979, 365, 395. [all data]
Hildenbrand, 1970
Hildenbrand, D.L.,
Electron impact studies of the IIA metal chlorides,
Intern. J. Mass Spectrom. Ion Phys., 1970, 4, 75. [all data]
Hildenbrand, 1970, 2
Hildenbrand, D.L.,
Dissociation energies and chemical bonding in the alkaline-earth chlorides from mass spectrometric studies,
J. Chem. Phys., 1970, 52, 5751. [all data]
Hammer, Allen, et al., 1978
Hammer, C.A.; Allen, J.D., Jr.; Cusachs, L.C.; Schweitzer, G.K.,
The high-temperature photoelectron spectra of alkaline-earth chlorides and iodides,
J. Electron Spectrosc. Relat. Phenom., 1978, 13, 149. [all data]