strontium bromide
- Formula: Br2Sr
- Molecular weight: 247.43
- CAS Registry Number: 10476-81-0

Condensed phase thermochemistry data

Quantity | Value | Units | Method | Reference | Comment |
---|---|---|---|---|---|
ΔfH°liquid | -705.10 | kJ/mol | Review | Chase, 1998 | Data last reviewed in June, 1974 |
Quantity | Value | Units | Method | Reference | Comment |
S°liquid,1 bar | 154.84 | J/mol*K | Review | Chase, 1998 | Data last reviewed in June, 1974 |
Quantity | Value | Units | Method | Reference | Comment |
ΔfH°solid | -717.97 | kJ/mol | Review | Chase, 1998 | Data last reviewed in June, 1974 |
Quantity | Value | Units | Method | Reference | Comment |
S°solid | 143.43 | J/mol*K | Review | Chase, 1998 | Data last reviewed in June, 1974 |
Liquid Phase Heat Capacity (Shomate Equation)
Cp° = A + B*t + C*t2 + D*t3 +
E/t2
H° − H°298.15= A*t + B*t2/2 +
C*t3/3 + D*t4/4 − E/t + F − H
S° = A*ln(t) + B*t + C*t2/2 + D*t3/3 −
E/(2*t2) + G
Cp = heat capacity (J/mol*K)
H° = standard enthalpy (kJ/mol)
S° = standard entropy (J/mol*K)
t = temperature (K) / 1000.
View plot Requires a JavaScript / HTML 5 canvas capable browser.
Temperature (K) | 930. to 3000. |
---|---|
A | 116.3909 |
B | 2.062119×10-8 |
C | -9.823907×10-9 |
D | 1.533545×10-9 |
E | 2.149230×10-9 |
F | -750.8230 |
G | 269.9262 |
H | -705.1002 |
Reference | Chase, 1998 |
Comment | Data last reviewed in June, 1974 |
Solid Phase Heat Capacity (Shomate Equation)
Cp° = A + B*t + C*t2 + D*t3 +
E/t2
H° − H°298.15= A*t + B*t2/2 +
C*t3/3 + D*t4/4 − E/t + F − H
S° = A*ln(t) + B*t + C*t2/2 + D*t3/3 −
E/(2*t2) + G
Cp = heat capacity (J/mol*K)
H° = standard enthalpy (kJ/mol)
S° = standard entropy (J/mol*K)
t = temperature (K) / 1000.
View plot Requires a JavaScript / HTML 5 canvas capable browser.
Temperature (K) | 298. to 918. | 918. to 930. |
---|---|---|
A | 72.84511 | 115.0600 |
B | 26.09762 | 0.000000 |
C | -32.30638 | 0.000000 |
D | 28.83864 | 0.000000 |
E | -0.147991 | 0.000000 |
F | -741.1245 | -759.7098 |
G | 224.1499 | 258.9423 |
H | -717.9744 | -717.9744 |
Reference | Chase, 1998 | Chase, 1998 |
Comment | Data last reviewed in June, 1974 | Data last reviewed in June, 1974 |

Gas phase ion energetics data

Data compiled as indicated in comments:
LBLHLM - Sharon G. Lias, John E. Bartmess, Joel F. Liebman, John L. Holmes, Rhoda D. Levin, and W. Gary Mallard
LLK - Sharon G. Lias, Rhoda D. Levin, and Sherif A. Kafafi
Ionization energy determinations
IE (eV) | Method | Reference | Comment |
---|---|---|---|
9.4 | S | Emons, Kiessling, et al., 1982 | LBLHLM |
9.11 | PE | Lee and Potts, 1979 | LLK |
9.82 ± 0.01 | PE | Lee and Potts, 1979 | Vertical value; LLK |
Appearance energy determinations
Ion | AE (eV) | Other Products | Method | Reference | Comment |
---|---|---|---|---|---|
BrSr+ | 9.9 | Br | S | Emons, Kiessling, et al., 1982 | LBLHLM |
Sr+ | 14.9 | Br2 | S | Emons, Kiessling, et al., 1982 | LBLHLM |

Gas phase thermochemistry data

Quantity Value Units Method Reference Comment
Δfgas-407.10kJ/molReviewChase, 1998Data last reviewed in June, 1974
Quantity Value Units Method Reference Comment
gas,1 bar323.41J/mol*KReviewChase, 1998Data last reviewed in June, 1974

Gas Phase Heat Capacity (Shomate Equation)

Cp° = A + B*t + C*t2 + D*t3 + E/t2
H° − H°298.15= A*t + B*t2/2 + C*t3/3 + D*t4/4 − E/t + F − H
S° = A*ln(t) + B*t + C*t2/2 + D*t3/3 − E/(2*t2) + G
    Cp = heat capacity (J/mol*K)
    H° = standard enthalpy (kJ/mol)
    S° = standard entropy (J/mol*K)
    t = temperature (K) / 1000.

View plot Requires a JavaScript / HTML 5 canvas capable browser.

View table.

Temperature (K) 3000. - 6000.
A 62.31942
B 0.032967
C -0.008935
D 0.000762
E -0.127959
F -426.1153
G 398.0997
H -407.1036
ReferenceChase, 1998
Comment Data last reviewed in June, 1974

References

Chase, 1998
Chase, M.W., Jr.,
NIST-JANAF Themochemical Tables, Fourth Edition,
J. Phys. Chem. Ref. Data, Monograph 9, 1998, 1-1951. [all data]
Emons, Kiessling, et al., 1982
Emons, H.-H.; Kiessling, D.; Horlbeck, W.,
Dampfdruckmessungen und massenspektrometrische untersuchungen der gasphase uber erdalkalimetallhalogeniden,
Z. Anorg. Allg. Chem., 1982, 488, 219. [all data]
Lee and Potts, 1979
Lee, E.P.F.; Potts, A.W.,
An investigation of the valence shell electronic structure of alkaline earth halides by using Ab initio S. C. F. calculations and photoelectron spectroscopy,
Proc. R. Soc. London A:, 1979, 365, 395. [all data]