Benzeneacetonitrile, 4-methoxy-
- Formula: C9H9NO
- Molecular weight: 147.1739
- IUPAC Standard InChIKey: PACGLQCRGWFBJH-UHFFFAOYSA-N
- CAS Registry Number: 104-47-2
- Chemical structure:
View 3d structure (requires JavaScript / HTML 5) - Other names: Acetonitrile, (p-methoxyphenyl)-; p-Methoxybenzeneacetonitrile; p-Methoxybenzyl cyanide; p-Methoxyphenylacetonitrile; 4-Methoxyphenylacetonitrile; 4-Methoxyphenylacetic acid nitrile; p-Anisylacetonitrile; Anisylacetonitrile; NSC 96

Phase change data

Data compiled by: Robert L. Brown and Stephen E. Stein
Quantity | Value | Units | Method | Reference | Comment |
---|---|---|---|---|---|
Tboil | 559.7 | K | N/A | Weast and Grasselli, 1989 |

Reaction thermochemistry data

Data compiled by: John E. Bartmess
Individual Reactions
C9H8NO- + =
By formula: C9H8NO- + H+ = C9H9NO
Quantity | Value | Units | Method | Reference | Comment |
---|---|---|---|---|---|
ΔrH° | 1471. ± 10. | kJ/mol | G+TS | Taft, 1987 | gas phase; value altered from reference due to change in acidity scale |
Quantity | Value | Units | Method | Reference | Comment |
ΔrG° | 1443. ± 8.4 | kJ/mol | IMRE | Taft, 1987 | gas phase; value altered from reference due to change in acidity scale |

Gas phase ion energetics data

Data compiled as indicated in comments:
B - John E. Bartmess
RDSH - Henry M. Rosenstock, Keith Draxl, Bruce W. Steiner, and John T. Herron
Ionization energy determinations
IE (eV) | Method | Reference | Comment |
---|---|---|---|
8.77 ± 0.05 | EI | Buchs, 1970 | RDSH |
De-protonation reactions
C9H8NO- + =
By formula: C9H8NO- + H+ = C9H9NO
Quantity | Value | Units | Method | Reference | Comment |
---|---|---|---|---|---|
ΔrH° | 1471. ± 10. | kJ/mol | G+TS | Taft, 1987 | gas phase; value altered from reference due to change in acidity scale; B |
Quantity | Value | Units | Method | Reference | Comment |
ΔrG° | 1443. ± 8.4 | kJ/mol | IMRE | Taft, 1987 | gas phase; value altered from reference due to change in acidity scale; B |

Normal alkane RI, non-polar column, temperature ramp

Column type | Active phase | I | Reference | Comment |
---|---|---|---|---|
Capillary | HP-1 | 1370. | Nyegue, Ndoye, et al., 2009 | 30. m/0.25 mm/0.25 μm, Helium, 10. K/min; Tstart: 70. C; Tend: 220. C |
Capillary | OV-101 | 1336. | Agnaniet, Mounzeo, et al., 2003 | 25. m/0.25 mm/0.25 μm, N2, 5. K/min; Tstart: 50. C; Tend: 200. C |

Normal alkane RI, polar column, temperature ramp

Column type | Active phase | I | Reference | Comment |
---|---|---|---|---|
Capillary | Carbowax 20M | 2305. | Agnaniet, Mounzeo, et al., 2003 | 25. m/0.22 mm/0.25 μm, N2, 5. K/min; Tstart: 50. C; Tend: 200. C |

References

Weast and Grasselli, 1989
CRC Handbook of Data on Organic Compounds, 2nd Editon, Weast,R.C and Grasselli, J.G., ed(s)., CRC Press, Inc., Boca Raton, FL, 1989, 1. [all data]
Taft, 1987
Taft, R.W.,
The Nature and Analysis of Substitutent Electronic Effects,
Personal communication. See also Prog. Phys. Org. Chem., 1987, 16, 1. [all data]
Buchs, 1970
Buchs, A.,
Etude par spectrometrie de masse de l'ionisation de benzonitriles, de phenylacetonitriles et de N,N-dimethylanilines substitues,
Helv. Chim. Acta, 1970, 53, 2026. [all data]