1,4-Hexadiyne
- Formula: C6H6
- Molecular weight: 78.1118
- IUPAC Standard InChIKey: NJXXWBJAOFKNIR-UHFFFAOYSA-N
- CAS Registry Number: 10420-91-4
- Chemical structure:
View 3d structure (requires JavaScript / HTML 5) - Permanent link for this species. Use this link for bookmarking this species for future reference.

Phase change data

Data compiled by: Robert L. Brown and Stephen E. Stein
Quantity | Value | Units | Method | Reference | Comment |
---|---|---|---|---|---|
Tboil | 353.7 | K | N/A | Weast and Grasselli, 1989 |

Gas phase ion energetics data

Data compiled as indicated in comments:
LBLHLM - Sharon G. Lias, John E. Bartmess, Joel F. Liebman, John L. Holmes, Rhoda D. Levin, and W. Gary Mallard
LLK - Sharon G. Lias, Rhoda D. Levin, and Sherif A. Kafafi
RDSH - Henry M. Rosenstock, Keith Draxl, Bruce W. Steiner, and John T. Herron
Ionization energy determinations
IE (eV) | Method | Reference | Comment |
---|---|---|---|
9.50 | PE | Rosenstock, Dannacher, et al., 1982 | LBLHLM |
9.66 ± 0.02 | PE | Bieri, Burger, et al., 1977 | LLK |
9.75 | EI | Momigny, Brakier, et al., 1962 | RDSH |
Appearance energy determinations
Ion | AE (eV) | Other Products | Method | Reference | Comment |
---|---|---|---|---|---|
C3H3+ | 12.05 | ? | EI | Momigny, Brakier, et al., 1962 | RDSH |
C4H2+ | 15.10 | ? | EI | Momigny, Brakier, et al., 1962 | RDSH |
C4H3+ | 15.70 | ? | EI | Momigny, Brakier, et al., 1962 | RDSH |
C4H4+ | 11.82 | C2H2 | EI | Momigny, Brakier, et al., 1962 | RDSH |
C6H4+ | 11.02 | H2 | EI | Momigny, Brakier, et al., 1962 | RDSH |
C6H5+ | 10.2 ± 0.1 | H | EI | Rosenstock, McCulloh, et al., 1977 | LLK |
C6H5+ | 11.50 | H | EI | Momigny, Brakier, et al., 1962 | RDSH |

Normal alkane RI, non-polar column, custom temperature program

Column type | Active phase | I | Reference | Comment |
---|---|---|---|---|
Capillary | Methyl Silicone | 667. | Zenkevich, 1998 | Program: not specified |

References

Weast and Grasselli, 1989
CRC Handbook of Data on Organic Compounds, 2nd Editon, Weast,R.C and Grasselli, J.G., ed(s)., CRC Press, Inc., Boca Raton, FL, 1989, 1. [all data]
Rosenstock, Dannacher, et al., 1982
Rosenstock, H.M.; Dannacher, J.; Liebman, J.F.,
The role of excited electronic states in ion fragmentation: C6H6+,
Radiat. Phys. Chem., 1982, 20, 7. [all data]
Bieri, Burger, et al., 1977
Bieri, G.; Burger, F.; Heilbronner, E.; Maier, J.P.,
Valence ionization enrgies of hydrocarbons,
Helv. Chim. Acta, 1977, 60, 2213. [all data]
Momigny, Brakier, et al., 1962
Momigny, J.; Brakier, L.; D'Or, L.,
Comparaison entre les effets de l'impact electronique sur le benzene et sur les isomeres du benzene en chaine ouverte,
Bull. Classe Sci. Acad. Roy. Belg., 1962, 48, 1002. [all data]
Rosenstock, McCulloh, et al., 1977
Rosenstock, H.M.; McCulloh, K.E.; Lossing, F.P.,
On the mechanisms of C6H6 ionization fragmentation,
Int. J. Mass Spectrom. Ion Phys., 1977, 25, 327. [all data]
Zenkevich, 1998
Zenkevich, I.G.,
Non-Traditional Criteria for Gas-Chromatographic and Chromato-Mass-Spectrometric Identification of Organic Compounds,
Zh. Anal. Khim., 1998, 53, 8, 828-835. [all data]