1,3-Hexadien-5-yne
- Formula: C6H6
- Molecular weight: 78.1118
- IUPAC Standard InChIKey: OGWJYLKDZYZYBA-UHFFFAOYSA-N
- CAS Registry Number: 10420-90-3
- Chemical structure:
View 3d structure (requires JavaScript / HTML 5) - Stereoisomers:
- Other names: Butadienylacetylene; HC≡CCH=CHCH=CH2

Phase change data

Data compiled as indicated in comments:
TRC - Thermodynamics Research Center, NIST Boulder Laboratories, Chris Muzny director
AC - William E. Acree, Jr., James S. Chickos
Quantity | Value | Units | Method | Reference | Comment |
---|---|---|---|---|---|
Tboil | 358. | K | N/A | Labarre, 1963 | Uncertainty assigned by TRC = 2. K; TRC |
Enthalpy of vaporization
ΔvapH (kJ/mol) | Temperature (K) | Method | Reference | Comment |
---|---|---|---|---|
44.0 | 238. | A | Stephenson and Malanowski, 1987 | Based on data from 223. to 303. K.; AC |

Gas phase ion energetics data

Data compiled as indicated in comments:
LBLHLM - Sharon G. Lias, John E. Bartmess, Joel F. Liebman, John L. Holmes, Rhoda D. Levin, and W. Gary Mallard
RDSH - Henry M. Rosenstock, Keith Draxl, Bruce W. Steiner, and John T. Herron
Ionization energy determinations
IE (eV) | Method | Reference | Comment |
---|---|---|---|
9.20 | PE | Rosenstock, Dannacher, et al., 1982 | LBLHLM |
9.50 | EI | Momigny, Brakier, et al., 1962 | RDSH |
Appearance energy determinations
Ion | AE (eV) | Other Products | Method | Reference | Comment |
---|---|---|---|---|---|
C3H3+ | 14.57 | ? | EI | Momigny, Brakier, et al., 1962 | RDSH |
C4H2+ | 17.55 | ? | EI | Momigny, Brakier, et al., 1962 | RDSH |
C4H3+ | 18.27 | ? | EI | Momigny, Brakier, et al., 1962 | RDSH |
C4H4+ | 14.77 | C2H2 | EI | Momigny, Brakier, et al., 1962 | RDSH |
C6H4+ | 13.72 | H2 | EI | Momigny, Brakier, et al., 1962 | RDSH |
C6H5+ | 13.52 | H | EI | Momigny, Brakier, et al., 1962 | RDSH |

Normal alkane RI, non-polar column, custom temperature program

Column type | Active phase | I | Reference | Comment |
---|---|---|---|---|
Capillary | Methyl Silicone | 670. | Zenkevich, 1998 | Program: not specified |

References

Labarre, 1963
Labarre, J.F.,
Contribution to the Study of Magneto-Optics of Bonds Between Atoms in Aliphatic Hydrocarbons,
Ann. Chim., 1963, 8, 45-83. [all data]
Stephenson and Malanowski, 1987
Stephenson, Richard M.; Malanowski, Stanislaw,
Handbook of the Thermodynamics of Organic Compounds, 1987, https://doi.org/10.1007/978-94-009-3173-2
. [all data]
Rosenstock, Dannacher, et al., 1982
Rosenstock, H.M.; Dannacher, J.; Liebman, J.F.,
The role of excited electronic states in ion fragmentation: C6H6+,
Radiat. Phys. Chem., 1982, 20, 7. [all data]
Momigny, Brakier, et al., 1962
Momigny, J.; Brakier, L.; D'Or, L.,
Comparaison entre les effets de l'impact electronique sur le benzene et sur les isomeres du benzene en chaine ouverte,
Bull. Classe Sci. Acad. Roy. Belg., 1962, 48, 1002. [all data]
Zenkevich, 1998
Zenkevich, I.G.,
Non-Traditional Criteria for Gas-Chromatographic and Chromato-Mass-Spectrometric Identification of Organic Compounds,
Zh. Anal. Khim., 1998, 53, 8, 828-835. [all data]