Propanenitrile-25
- Formula: C3D5N
- Molecular weight: 60.1093
- IUPAC Standard InChIKey: FVSKHRXBFJPNKK-ZBJDZAJPSA-N
- CAS Registry Number: 10419-75-7
- Chemical structure:
View 3d structure (requires JavaScript / HTML 5) - Isotopologues:

Gas phase ion energetics data

Data compiled by: Henry M. Rosenstock, Keith Draxl, Bruce W. Steiner, and John T. Herron
Ionization energy determinations
IE (eV) | Method | Reference |
---|---|---|
11.75 ± 0.05 | EI | Franklin, Wada, et al., 1966 |

References

Franklin, Wada, et al., 1966
Franklin, J.L.; Wada, Y.; Natalis, P.; Hierl, P.M.,
Ion-molecule reactions in acetonitrile and propionitrile,
J. Phys. Chem., 1966, 70, 2353. [all data]