Benzenamine, 4-butyl-
- Formula: C10H15N
- Molecular weight: 149.2328
- IUPAC Standard InChIKey: OGIQUQKNJJTLSZ-UHFFFAOYSA-N
- CAS Registry Number: 104-13-2
- Chemical structure:
View 3d structure (requires JavaScript / HTML 5) - Other names: Aniline, p-butyl-; p-n-Butylaniline; p-Aminobutylbenzene; p-Butyl aniline; 4-Butylaniline; 4-Butylbenzenamine; 4-Butylbenzeneamine; 4-n-Butylaniline; Aniline, 4-butyl-; 1-Amino-4-butylbenzene; p-Butylaminobenzene

Phase change data

Data compiled by: Robert L. Brown and Stephen E. Stein
Reduced pressure boiling point
Tboil (K) | Pressure (bar) | Reference |
---|---|---|
392.2 | 0.020 | Aldrich Chemical Company Inc., 1990 |
406.7 | 0.019 | Weast and Grasselli, 1989 |
399. | 0.024 | Frinton Laboratories Inc., 1986 |

Gas phase ion energetics data

Data compiled by: Sharon G. Lias, Rhoda D. Levin, and Sherif A. Kafafi
Ionization energy determinations
IE (eV) | Method | Reference |
---|---|---|
7.6 ± 0.1 | EI | Lightner, Majeti, et al., 1972 |
Appearance energy determinations
Ion | AE (eV) | Other Products | Method | Reference | Comment |
---|---|---|---|---|---|
C7H8N+ | 11.1 ± 0.1 | ? | EI | Lightner, Majeti, et al., 1972 | |
C7H9N+ | 9.4 ± 0.1 | CH2=CHCH3 | EI | Lightner, Majeti, et al., 1972 |

Kovats' RI, polar column, isothermal

Column type | Active phase | Temperature (C) | I | Reference | Comment |
---|---|---|---|---|---|
Packed | Carbowax 20M | 200. | 2155. | Vernon and Suratman, 1983 | He, Silanized white support; Column length: 2. m |

References

Aldrich Chemical Company Inc., 1990
Aldrich Chemical Company Inc.,
Catalog Handbook of Fine Chemicals, Aldrich Chemical Company, Inc., Milwaukee WI, 1990, 1. [all data]
Weast and Grasselli, 1989
CRC Handbook of Data on Organic Compounds, 2nd Editon, Weast,R.C and Grasselli, J.G., ed(s)., CRC Press, Inc., Boca Raton, FL, 1989, 1. [all data]
Frinton Laboratories Inc., 1986
Frinton Laboratories Inc.,
Catalog Number 11, Frinton Laboratories Inc., Vineland, NJ, 1986, 99. [all data]
Lightner, Majeti, et al., 1972
Lightner, D.A.; Majeti, S.; Nicoletti, R.; Thommen, E.,
Benzyl vs. tropylium ions in the electron impact induced decomposition of n- butylbenzenes,
Intra-Sci. Chem. Rep., 1972, 6, 113. [all data]
Vernon and Suratman, 1983
Vernon, F.; Suratman, J.B.,
The retention index system applied to alkylbenzenes and monosubstituted derivatives,
Chromatographia, 1983, 17, 11, 600-604, https://doi.org/10.1007/BF02261943
. [all data]