Benzene, 1-chloro-4-isocyanato-
- Formula: C7H4ClNO
- Molecular weight: 153.566
- IUPAC Standard InChIKey: ADAKRBAJFHTIEW-UHFFFAOYSA-N
- CAS Registry Number: 104-12-1
- Chemical structure:
View 3d structure (requires JavaScript / HTML 5) - Other names: Isocyanic acid, p-chlorophenyl ester; p-Chlorophenyl isocyanate; 1-Chloro-4-isocyanatobenzene; 4-Chlorophenyl isocyanate; para-Chlorophenyl isocyanate; 4-Chloro-iso-cyanatobenzene; p-Chlorfenylisokyanat; PCPI; NSC 76589; Phenylisocyanate, 4-chloro (Monuron decomposition product)

Condensed phase thermochemistry data

Data compiled as indicated in comments:
ALS - Hussein Y. Afeefy, Joel F. Liebman, and Stephen E. Stein
DH - Eugene S. Domalski and Elizabeth D. Hearing
Quantity | Value | Units | Method | Reference | Comment |
---|---|---|---|---|---|
ΔcH°liquid | -3320.5 ± 5.1 | kJ/mol | Ccb | Zalikin, Kochetkov, et al., 1965 | ALS |
Quantity | Value | Units | Method | Reference | Comment |
ΔfH°solid | -83.7 ± 4.2 | kJ/mol | Ccb | Selivanov and Konstantinov, 1975 | ALS |
Quantity | Value | Units | Method | Reference | Comment |
ΔcH°solid | -3259. ± 4.2 | kJ/mol | Ccb | Selivanov and Konstantinov, 1975 | ALS |
Constant pressure heat capacity of solid
Cp,solid (J/mol*K) | Temperature (K) | Reference | Comment |
---|---|---|---|
210.9 | 282. | Zalikin, Kochetkov, et al., 1965 | T = 273 to 290 K. Mean value.; DH |

Phase change data

Data compiled as indicated in comments:
ALS - Hussein Y. Afeefy, Joel F. Liebman, and Stephen E. Stein
AC - William E. Acree, Jr., James S. Chickos
Quantity | Value | Units | Method | Reference | Comment |
---|---|---|---|---|---|
ΔvapH° | 49.8 ± 0.2 | kJ/mol | V | Zalikin, Kochetkov, et al., 1965 | ALS |
Enthalpy of vaporization
ΔvapH (kJ/mol) | Temperature (K) | Method | Reference | Comment |
---|---|---|---|---|
48.9 | 378. | A | Stephenson and Malanowski, 1987 | Based on data from 363. to 443. K.; AC |
44.3 | 338. | N/A | Konstantinov, Zhuravlev, et al., 1967 | Based on data from 323. to 433. K.; AC |
Antoine Equation Parameters
log10(P) = A − (B / (T + C))
P = vapor pressure (bar)
T = temperature (K)
View plot Requires a JavaScript / HTML 5 canvas capable browser.
Temperature (K) | A | B | C | Reference | Comment |
---|---|---|---|---|---|
323. to 433. | 9.42732 | 6638.386 | 234.438 | Konstantinov, zhuravlev, et al., 1967 | Coefficents calculated by NIST from author's data. |
333. to 423. | 2.08504 | 659.03 | -190.849 | Zalikin, Kochetkov, et al., 1965 | Coefficents calculated by NIST from author's data. |

Reaction thermochemistry data

Data compiled by: Hussein Y. Afeefy, Joel F. Liebman, and Stephen E. Stein
Individual Reactions
By formula: C9H11ClN2O = C7H4ClNO + C2H7N
Quantity | Value | Units | Method | Reference | Comment |
---|---|---|---|---|---|
ΔrH° | 155.0 ± 2.5 | kJ/mol | Eqk | Chimishkyan, Svetlova, et al., 1984 | solid phase; Dissociation |
By formula: C13H10Cl2N2O = C7H4ClNO + C6H6ClN
Quantity | Value | Units | Method | Reference | Comment |
---|---|---|---|---|---|
ΔrH° | 120.5 ± 1.1 | kJ/mol | Eqk | Chimishkyan, Svetlova, et al., 1984 | solid phase; Dissociation |

Gas phase ion energetics data

Data compiled by: Sharon G. Lias, Rhoda D. Levin, and Sherif A. Kafafi
Ionization energy determinations
IE (eV) | Method | Reference | Comment |
---|---|---|---|
8.8 ± 0.1 | PE | Neijzen and DeLange, 1980 | Vertical value |

Normal alkane RI, non-polar column, custom temperature program

Column type | Active phase | I | Reference | Comment |
---|---|---|---|---|
Other | Methyl Silicone | 1100. | Ardrey and Moffat, 1981 | Program: not specified |

References

Zalikin, Kochetkov, et al., 1965
Zalikin, A.A.; Kochetkov, V.L.; Strepikheev, Yu.A.,
Some physical and physicochemical constants of m- and p-chloroaniline and of m- and p-chlorophenyl isocyanate,
Khim. Prom. (Moscow), 1965, 41, 338. [all data]
Selivanov and Konstantinov, 1975
Selivanov, V.D.; Konstantinov, I.I.,
Thermochemistry of chloroaryl isocyanates,
Russ. J. Phys. Chem. (Engl. Transl.), 1975, 49, 620-621. [all data]
Stephenson and Malanowski, 1987
Stephenson, Richard M.; Malanowski, Stanislaw,
Handbook of the Thermodynamics of Organic Compounds, 1987, https://doi.org/10.1007/978-94-009-3173-2
. [all data]
Konstantinov, Zhuravlev, et al., 1967
Konstantinov, I.I.; Zhuravlev, E.Z.; Teplova, Z.G.,
Zh. Prikl. Khim., 1967, 40, 5, 1084. [all data]
Konstantinov, zhuravlev, et al., 1967
Konstantinov, I.I.; zhuravlev, E.Z.; Tenrova, Z.G.,
Some Physico-Chemical Properties of n-Chlorophenyl Isocyanate and 3,4-Dichlorophenylisocyanate,
Zh. Prikl. Khim. (Moscow), 1967, 40, 1084-1087. [all data]
Chimishkyan, Svetlova, et al., 1984
Chimishkyan, A.L.; Svetlova, L.P.; Leonova, T.V.; Gluyaev, N.D.,
Thermal decomposition of substituted ureas,
J. Gen. Chem. USSR, 1984, 54, 1317-1320. [all data]
Neijzen and DeLange, 1980
Neijzen, B.J.M.; DeLange, C.A.,
Photoelectron spectroscopy of some thiocyanates, isocyanates and isothiocyanates,
J. Electron Spectrosc. Relat. Phenom., 1980, 18, 179. [all data]
Ardrey and Moffat, 1981
Ardrey, R.E.; Moffat, A.C.,
Gas-liquid chromatographic retention indices of 1318 substances of toxicological interest on SE-30 or OV-1 stationary phase,
J. Chromatogr., 1981, 220, 3, 195-252, https://doi.org/10.1016/S0021-9673(00)81925-1
. [all data]