Difluoramine
- Formula: F2HN
- Molecular weight: 53.0114
- IUPAC Standard InChIKey: ULFHSQLFQYTZLS-UHFFFAOYSA-N
- CAS Registry Number: 10405-27-3
- Chemical structure:
View 3d structure (requires JavaScript / HTML 5) - Other names: Difluoroamine; HNF2; Fluorimide

Phase change data

Data compiled by: Thermodynamics Research Center, NIST Boulder Laboratories, Chris Muzny director
Quantity | Value | Units | Method | Reference | Comment |
---|---|---|---|---|---|
Tboil | 250. | K | N/A | Kennedy and Colburn, 1959 | Uncertainty assigned by TRC = 3. K |
Quantity | Value | Units | Method | Reference | Comment |
Tfus | 142. | K | N/A | Kennedy and Colburn, 1959 | Uncertainty assigned by TRC = 3. K |

Reaction thermochemistry data

Data compiled by: John E. Bartmess
Individual Reactions
F2N- + =
Quantity | Value | Units | Method | Reference | Comment |
---|---|---|---|---|---|
ΔrH° | 1552. ± 8.8 | kJ/mol | G+TS | Koppel, Taft, et al., 1994 | gas phase; Exptl, not interpolated dHf(F2NH) from Gurvich, Veyts, et al., is used. It agrees far better with MO calns |
ΔrH° | 1506. ± 8.8 | kJ/mol | IMRE | Koppel, Pikver, et al., 1981 | gas phase; This acidity disagrees with the authors' later( Koppel, Taft, et al., 1994) value by 10 kcal/mol, but agrees with G3(MP2) computations much better.The acidity of HNF2 is not well known therefore. |
ΔrH° | 1530. ± 15. | kJ/mol | D-EA | Ruckhaberle, Lehmann, et al., 1997 | gas phase |
Quantity | Value | Units | Method | Reference | Comment |
ΔrG° | 1520. ± 8.4 | kJ/mol | IMRE | Koppel, Taft, et al., 1994 | gas phase; Exptl, not interpolated dHf(F2NH) from Gurvich, Veyts, et al., is used. It agrees far better with MO calns |
ΔrG° | 1474. ± 8.4 | kJ/mol | H-TS | Koppel, Pikver, et al., 1981 | gas phase; This acidity disagrees with the authors' later( Koppel, Taft, et al., 1994) value by 10 kcal/mol, but agrees with G3(MP2) computations much better.The acidity of HNF2 is not well known therefore. |

Gas phase ion energetics data

Data compiled as indicated in comments:
B - John E. Bartmess
LL - Sharon G. Lias and Joel F. Liebman
LLK - Sharon G. Lias, Rhoda D. Levin, and Sherif A. Kafafi
Ionization energy determinations
IE (eV) | Method | Reference | Comment |
---|---|---|---|
11.60 | PE | Baumgartel, Jochims, et al., 1989 | LL |
11.53 ± 0.08 | PE | Colbourne, Frost, et al., 1980 | LLK |
12.38 | PE | Baumgartel, Jochims, et al., 1989 | Vertical value; LL |
Appearance energy determinations
Ion | AE (eV) | Other Products | Method | Reference | Comment |
---|---|---|---|---|---|
F2N+ | 15.1 | H | PE | Baumgartel, Jochims, et al., 1989 | LL |
De-protonation reactions
F2N- + =
Quantity | Value | Units | Method | Reference | Comment |
---|---|---|---|---|---|
ΔrH° | 1552. ± 8.8 | kJ/mol | G+TS | Koppel, Taft, et al., 1994 | gas phase; Exptl, not interpolated dHf(F2NH) from Gurvich, Veyts, et al., is used. It agrees far better with MO calns; B |
ΔrH° | 1506. ± 8.8 | kJ/mol | IMRE | Koppel, Pikver, et al., 1981 | gas phase; This acidity disagrees with the authors' later( Koppel, Taft, et al., 1994) value by 10 kcal/mol, but agrees with G3(MP2) computations much better.The acidity of HNF2 is not well known therefore.; B |
ΔrH° | 1530. ± 15. | kJ/mol | D-EA | Ruckhaberle, Lehmann, et al., 1997 | gas phase; B |
Quantity | Value | Units | Method | Reference | Comment |
ΔrG° | 1520. ± 8.4 | kJ/mol | IMRE | Koppel, Taft, et al., 1994 | gas phase; Exptl, not interpolated dHf(F2NH) from Gurvich, Veyts, et al., is used. It agrees far better with MO calns; B |
ΔrG° | 1474. ± 8.4 | kJ/mol | H-TS | Koppel, Pikver, et al., 1981 | gas phase; This acidity disagrees with the authors' later( Koppel, Taft, et al., 1994) value by 10 kcal/mol, but agrees with G3(MP2) computations much better.The acidity of HNF2 is not well known therefore.; B |

Vibrational and/or electronic energy levels

Data compiled by: Takehiko Shimanouchi
Symmetry: Cs Symmetry Number σ = 1
Sym. | No | Approximate | Selected Freq. | Infrared | Raman | Comments | ||||
---|---|---|---|---|---|---|---|---|---|---|
Species | type of mode | Value | Rating | Value | Phase | Value | Phase | |||
a' | 1 | NH str | 3193 | C | 3193 W | gas | ||||
a' | 2 | NH bend | 1307 | B | 1307 S | gas | ||||
a' | 3 | NF2 s-str | 972 | B | 972 S | gas | ||||
a' | 4 | NF2 scis | 500 | C | 500 M | gas | ||||
a | 5 | NH bend | 1424 | B | 1424 S | gas | ||||
a | 6 | NF2 a-str | 888 | C | 888 VS | gas | ||||
Source: Shimanouchi, 1972

References

Kennedy and Colburn, 1959
Kennedy, A.; Colburn, C.B.,
Difluoroamine,
J. Am. Chem. Soc., 1959, 81, 2906-7. [all data]
Koppel, Taft, et al., 1994
Koppel, I.A.; Taft, R.W.; Anvia, F.; Zhu, S.Z.; Hu, L.Q.; Sung, K.S.; Desmarteau, D.D.; Yagupolskii, L.M.,
The Gas-Phase Acidities of Very Strong Neutral Bronsted Acids,
J. Am. Chem. Soc., 1994, 116, 7, 3047, https://doi.org/10.1021/ja00086a038
. [all data]
Gurvich, Veyts, et al.
Gurvich, L.V.; Veyts, I.V.; Alcock, C.B.,
Hemisphere Publishing, NY, 1989, V. 1 2, Thermodynamic Properties of Individual Substances, 4th Ed. [all data]
Koppel, Pikver, et al., 1981
Koppel, I.; Pikver, R.; Sugis, A.; Suurmaa, E.; Lippmaa, E.,
FTICR Study of Structure and Solvent Effects on Basicity of Some Anions in the Gas Phase,
Org. Reac., 1981, 18, 3. [all data]
Ruckhaberle, Lehmann, et al., 1997
Ruckhaberle, N.; Lehmann, L.; Matejcik, S.; Illenberger, E.; Bouteiller, Y.; Periquet, V.; Museur, L.; Desfran,
Free Electron Attachment and Rydberg Electron Transfer to NF3 Molecules and Clusters,
J. Phys. Chem. A, 1997, 101, 51, 9942, https://doi.org/10.1021/jp972422+
. [all data]
Baumgartel, Jochims, et al., 1989
Baumgartel, H.; Jochims, H.-W.; Ruhl, E.; Bock, H.; Dammel, R.; Minkwitz, J.; Nass, R.,
Photoelectron and photoionization mass spectra of the fluoramines NH3-nFn1,
Inorg. Chem., 1989, 28, 943. [all data]
Colbourne, Frost, et al., 1980
Colbourne, D.; Frost, D.C.; McDowell, C.A.; Westwood, N.P.C.,
The vacuum ultraviolet photoelectron spectrum of difluoramine,
Chem. Phys. Lett., 1980, 72, 247. [all data]
Shimanouchi, 1972
Shimanouchi, T.,
Tables of Molecular Vibrational Frequencies Consolidated Volume II,
J. Phys. Chem. Ref. Data, 1972, 6, 3, 993-1102. [all data]