Acetamide, N-(4-nitrophenyl)-
- Formula: C8H8N2O3
- Molecular weight: 180.1607
- IUPAC Standard InChIKey: NQRLPDFELNCFHW-UHFFFAOYSA-N
- CAS Registry Number: 104-04-1
- Chemical structure:

Condensed phase thermochemistry data

Data compiled by: Eugene S. Domalski and Elizabeth D. Hearing
Constant pressure heat capacity of solid
Cp,solid (J/mol*K) | Temperature (K) | Reference | Comment |
---|---|---|---|
230.5 | 323. | Satoh and Sogabe, 1941 | T = 0 to 100 C. Mean value. |

Phase change data

Data compiled by: Thermodynamics Research Center, NIST Boulder Laboratories, Chris Muzny director
Quantity | Value | Units | Method | Reference | Comment |
---|---|---|---|---|---|
Tfus | 489.1 | K | N/A | Sidgwick and Rubie, 1921 | Uncertainty assigned by TRC = 0.1 K |

Gas phase ion energetics data

Data compiled by: Henry M. Rosenstock, Keith Draxl, Bruce W. Steiner, and John T. Herron
Ionization energy determinations
IE (eV) | Method | Reference |
---|---|---|
9.1 ± 0.2 | EI | Gamble, Gilbert, et al., 1970 |
Appearance energy determinations
Ion | AE (eV) | Other Products | Method | Reference | Comment |
---|---|---|---|---|---|
C6H6N2O2+ | 10.4 ± 0.2 | ? | EI | Gamble, Gilbert, et al., 1970 |

References

Satoh and Sogabe, 1941
Satoh, S.; Sogabe, T.,
The heat capacities of some organic compounds containing nitrogen and the atomic heat of nitrogen. (1), Sci.,
Pap. Inst. Phys. Chem. Res. (Tokyo), 1941, 38, 197-203. [all data]
Sidgwick and Rubie, 1921
Sidgwick, N.V.; Rubie, H.E.,
The solubility and volatility of the chloro- and nitro-anilines and of their acetyl derivatives,
J. Chem. Soc., 1921, 119, 1013-24. [all data]
Gamble, Gilbert, et al., 1970
Gamble, A.A.; Gilbert, J.R.; Tillett, J.G.,
Substituent effects in the fragmentation of acetanilides,,
J. Chem. Soc. B, 1970, 1231. [all data]
Chmilenko, et al., 1977
Chmilenko, T.S., et al.,
Khim. Geterosikl. Soedin., 1977, 525. [all data]