Bicyclo[2.2.1]hept-5-en-2-ol, 3-ethenyl-, (exo)-
- Formula: C9H12O
- Molecular weight: 136.1910
- IUPAC Standard InChIKey: NTIDMOBOUNQJEP-UHFFFAOYSA-N
- CAS Registry Number: 104013-09-4
- Chemical structure:
View 3d structure (requires JavaScript / HTML 5) - Stereoisomers:

Gas phase ion energetics data

Data compiled by: Sharon G. Lias, John E. Bartmess, Joel F. Liebman, John L. Holmes, Rhoda D. Levin, and W. Gary Mallard
Appearance energy determinations
Ion | AE (eV) | Other Products | Method | Reference | Comment |
---|---|---|---|---|---|
C4H6O+ | 8.95 ± 0.06 | C5H6 | EI | Turecek and Havlas, 1986 |

References

Turecek and Havlas, 1986
Turecek, F.; Havlas, Z.,
Energy barriers to the diels-alder cycloadditions and cycloreversions of cation-radicals in the gas phase,
J. Chem. Soc. Perkin Trans. 2, 1986, 1011. [all data]