2-Norbornanone dimethyl ketal
- Formula: C9H14O2
- Molecular weight: 154.2063
- IUPAC Standard InChIKey: KQURPPICIBDUHU-UHFFFAOYSA-N
- CAS Registry Number: 10395-51-4
- Chemical structure:
View 3d structure (requires JavaScript / HTML 5) - Permanent link for this species. Use this link for bookmarking this species for future reference.

Phase change data

Data compiled by: Hussein Y. Afeefy, Joel F. Liebman, and Stephen E. Stein
Quantity | Value | Units | Method | Reference | Comment |
---|---|---|---|---|---|
ΔvapH° | 53.01 ± 0.08 | kJ/mol | E | Wiberg and Cunningham, 1990 | Heat of hydrolysis |

Reaction thermochemistry data

Data compiled by: Hussein Y. Afeefy, Joel F. Liebman, and Stephen E. Stein
Individual Reactions
By formula: C9H14O2 + 2H2O = C7H10O + 2CH4O
Quantity | Value | Units | Method | Reference | Comment |
---|---|---|---|---|---|
ΔrH° | 22.97 ± 0.11 | kJ/mol | Cm | Wiberg and Cunningham, 1990 | liquid phase; Heat of hydrolysis |

References

Wiberg and Cunningham, 1990
Wiberg, K.B.; Cunningham, W.C., Jr.,
Thermochemical studies of carbonyl reactions. 4. Enthalpies of hydrolysis of norbornyl ketals,
J. Org. Chem., 1990, 55, 679-684. [all data]