1-Buten-3-yn-2-ol
- Formula: C4H4O
- Molecular weight: 68.0740
- IUPAC Standard InChIKey: RYEFLTCEZABBRX-UHFFFAOYSA-N
- CAS Registry Number: 103905-52-8
- Chemical structure:
View 3d structure (requires JavaScript / HTML 5) - Permanent link for this species. Use this link for bookmarking this species for future reference.

Gas phase thermochemistry data

Data compiled by: Hussein Y. Afeefy, Joel F. Liebman, and Stephen E. Stein
Quantity | Value | Units | Method | Reference | Comment |
---|---|---|---|---|---|
ΔfH°gas | 83. ± 7. | kJ/mol | Ion | Turecek, Havlas, et al., 1986 |

Gas phase ion energetics data

Data compiled as indicated in comments:
LBLHLM - Sharon G. Lias, John E. Bartmess, Joel F. Liebman, John L. Holmes, Rhoda D. Levin, and W. Gary Mallard
LLK - Sharon G. Lias, Rhoda D. Levin, and Sherif A. Kafafi
Quantity | Value | Units | Method | Reference | Comment |
---|---|---|---|---|---|
ΔfH°(+) ion | 946. | kJ/mol | N/A | N/A |
Ionization energy determinations
IE (eV) | Method | Reference | Comment |
---|---|---|---|
8.92 ± 0.03 | EI | Turecek, Havlas, et al., 1986, 2 | LBLHLM |
>9.0 | EI | Holmes and Terlouw, 1979 | LLK |
Appearance energy determinations
Ion | AE (eV) | Other Products | Method | Reference | Comment |
---|---|---|---|---|---|
C3H4+ | 10.22 ± 0.08 | CO | EI | Turecek, Havlas, et al., 1986, 2 | LBLHLM |
C4HO+ | 11.20 ± 0.07 | CH3 | EI | Turecek, Havlas, et al., 1986, 2 | LBLHLM |

References

Turecek, Havlas, et al., 1986
Turecek, F.; Havlas, Z.; Maquin, F.; Gaumann, T.,
Mass spectra of organic compounds. Part 8. 1-buten-3-yn-2-ol. A new kinetically unstable C4H4O isomer,
Helv. Chim. Acta, 1986, 69, 683-691. [all data]
Turecek, Havlas, et al., 1986, 2
Turecek, F.; Havlas, Z.; Maquin, F.; Gaumann, T.,
72. The mass spectra of organic compounds 1-buten-3-yn-2-ol. A new kinetically unstable C4H4O isomer,
Helv. Chim. Acta, 1986, 69, 683. [all data]
Holmes and Terlouw, 1979
Holmes, J.L.; Terlouw, J.K.,
Structures of [C4H4O]+ ions produced from 2- and 4-pyrone,
J. Am. Chem. Soc., 1979, 101, 4973. [all data]