Thiourea, phenyl-
- Formula: C7H8N2S
- Molecular weight: 152.217
- IUPAC Standard InChIKey: FULZLIGZKMKICU-UHFFFAOYSA-N
- CAS Registry Number: 103-85-5
- Chemical structure:
View 3d structure (requires JavaScript / HTML 5) - Other names: Urea, 1-phenyl-2-thio-; α-Phenylthiourea; N-Phenylthiourea; Phenylthiocarbamide; Phenylthiourea; PTU; U 6324; 1-Phenyl-2-Thiourea; 1-Phenylthiourea; NCI-C02017; USAF EK-1569; Fenylthiomocovina; Rcra waste number P093; NSC 5779; Phenyl-2-thiourea; Thiourea, N-phenyl-

Gas phase ion energetics data

Data compiled by: Sharon G. Lias, Rhoda D. Levin, and Sherif A. Kafafi
Ionization energy determinations
IE (eV) | Method | Reference |
---|---|---|
8.10 | EI | Baldwin, Loudon, et al., 1976 |
Appearance energy determinations
Ion | AE (eV) | Other Products | Method | Reference | Comment |
---|---|---|---|---|---|
C7H7N2S+ | 9.65 | H | EI | Baldwin, Loudon, et al., 1976 |

References

Baldwin, Loudon, et al., 1976
Baldwin, M.A.; Loudon, A.G.; Maccoll, A.; Webb, K.S.,
The nature and fragmentation pathways of the molecular ions of some arylureas, arylthioureas, acetanilides, thioacetanilides and related compounds,
Org. Mass Spectrom., 1976, 11, 1181. [all data]
Smith and Williams, 1961
Smith, R.L.; Williams, R.T.,
J. Med. Chem., 1961, 4, 147. [all data]