Benzeneacetic acid
- Formula: C8H8O2
- Molecular weight: 136.1479
- IUPAC Standard InChIKey: WLJVXDMOQOGPHL-UHFFFAOYSA-N
- CAS Registry Number: 103-82-2
- Chemical structure:
View 3d structure (requires JavaScript / HTML 5) - Other names: Acetic acid, phenyl-; α-Toluic acid; Benzenacetic acid; Phenylacetic acid; ω-Phenylacetic acid; Phenylethanoic acid; Kyselina fenyloctova; 2-Phenylacetic acid; NSC 125718

Condensed phase thermochemistry data

Data compiled by: Hussein Y. Afeefy, Joel F. Liebman, and Stephen E. Stein
Quantity | Value | Units | Method | Reference | Comment |
---|---|---|---|---|---|
ΔcH°solid | -931.33 ± 0.19 | kcal/mol | Ccb | Wrede, 1911 | Corresponding ΔfHºsolid = -94.34 kcal/mol (simple calculation by NIST; no Washburn corrections) |
ΔcH°solid | -931.5 | kcal/mol | Ccb | Auwers and Roth, 1910 | Corresponding ΔfHºsolid = -94.2 kcal/mol (simple calculation by NIST; no Washburn corrections) |
ΔcH°solid | -933.4 | kcal/mol | Ccb | Fischer and Wrede, 1904 | Heat of combustion corrected for pressure; Corresponding ΔfHºsolid = -92.3 kcal/mol (simple calculation by NIST; no Washburn corrections) |
ΔcH°solid | -934.5 | kcal/mol | Ccb | Lemoult, 1904 | Corresponding ΔfHºsolid = -91.1 kcal/mol (simple calculation by NIST; no Washburn corrections) |

Phase change data

Data compiled as indicated in comments:
BS - Robert L. Brown and Stephen E. Stein
TRC - Thermodynamics Research Center, NIST Boulder Laboratories, Chris Muzny director
AC - William E. Acree, Jr., James S. Chickos
Quantity | Value | Units | Method | Reference | Comment |
---|---|---|---|---|---|
Tboil | 538.7 | K | N/A | Weast and Grasselli, 1989 | BS |
Quantity | Value | Units | Method | Reference | Comment |
Tfus | 348. | K | N/A | Henne and Hill, 1943 | Uncertainty assigned by TRC = 2. K; TRC |
Tfus | 349.15 | K | N/A | Adams and Marshall, 1928 | Uncertainty assigned by TRC = 1. K; TRC |
Tfus | 350. | K | N/A | Robertson, 1902 | Uncertainty assigned by TRC = 2. K; TRC |
Tfus | 348.05 | K | N/A | Bruner, 1894 | Uncertainty assigned by TRC = 0.6 K; TRC |
Quantity | Value | Units | Method | Reference | Comment |
ΔvapH° | 18.9 ± 0.07 | kcal/mol | GS | Roux *, Temprado, et al., 2004 | Based on data from 353. to 392. K.; AC |
Quantity | Value | Units | Method | Reference | Comment |
ΔsubH° | 22.3 ± 0.07 | kcal/mol | GS | Roux *, Temprado, et al., 2004 | Based on data from 307. to 339. K.; AC |
ΔsubH° | 23.7 ± 0.1 | kcal/mol | ME | Monte and Hillesheim, 2001 | Based on data from 305. to 321. K.; AC |
Enthalpy of vaporization
ΔvapH (kcal/mol) | Temperature (K) | Method | Reference | Comment |
---|---|---|---|---|
15.5 | 385. | A | Stephenson and Malanowski, 1987 | Based on data from 370. to 539. K.; AC |
Enthalpy of sublimation
ΔsubH (kcal/mol) | Temperature (K) | Method | Reference | Comment |
---|---|---|---|---|
23.6 ± 0.1 | 313. | ME | Monte and Hillesheim, 2001 | Based on data from 305. to 321. K.; AC |
Enthalpy of fusion
ΔfusH (kcal/mol) | Temperature (K) | Method | Reference | Comment |
---|---|---|---|---|
3.63 | 349.2 | N/A | Gracin and Rasmuson, 2002 | AC |
3.94 | 350.8 | N/A | Monte and Hillesheim, 2001 | AC |
3.463 | 349.9 | DSC | Acree, 1991 | There is a large discrepancy between the value of 32.0 kJ/mole and the other reported literature values. Reference Sharma, Kant, et al., 2003 quotes a literature value of 32.0 kJ/mole; however, the authors do not provide the source of the cited literature value.; AC |

Reaction thermochemistry data

Data compiled by: John E. Bartmess
Individual Reactions
C8H7O2- + =
By formula: C8H7O2- + H+ = C8H8O2
Quantity | Value | Units | Method | Reference | Comment |
---|---|---|---|---|---|
ΔrH° | 341.5 ± 2.1 | kcal/mol | G+TS | Caldwell, Renneboog, et al., 1989 | gas phase |
ΔrH° | 341.1 ± 2.1 | kcal/mol | G+TS | Jinfeng, Topsom, et al., 1988 | gas phase; value altered from reference due to change in acidity scale |
Quantity | Value | Units | Method | Reference | Comment |
ΔrG° | 334.5 ± 2.0 | kcal/mol | IMRE | Caldwell, Renneboog, et al., 1989 | gas phase |
ΔrG° | 334.1 ± 2.0 | kcal/mol | IMRE | Jinfeng, Topsom, et al., 1988 | gas phase; value altered from reference due to change in acidity scale |

Gas phase ion energetics data

Data evaluated as indicated in comments:
L - Sharon G. Lias
Data compiled as indicated in comments:
B - John E. Bartmess
LBLHLM - Sharon G. Lias, John E. Bartmess, Joel F. Liebman, John L. Holmes, Rhoda D. Levin, and W. Gary Mallard
LLK - Sharon G. Lias, Rhoda D. Levin, and Sherif A. Kafafi
Quantity | Value | Units | Method | Reference | Comment |
---|---|---|---|---|---|
IE (evaluated) | 8.26 | eV | N/A | N/A | L |
Ionization energy determinations
IE (eV) | Method | Reference | Comment |
---|---|---|---|
~8.26 | PE | Klasinc, Kovac, et al., 1983 | LBLHLM |
8.26 | PE | Meeks, Wahlborg, et al., 1981 | LLK |
8.72 | PE | Klasinc, Kovac, et al., 1983 | Vertical value; LBLHLM |
9.1 | PE | Meeks, Wahlborg, et al., 1981 | Vertical value; LLK |
De-protonation reactions
C8H7O2- + =
By formula: C8H7O2- + H+ = C8H8O2
Quantity | Value | Units | Method | Reference | Comment |
---|---|---|---|---|---|
ΔrH° | 341.5 ± 2.1 | kcal/mol | G+TS | Caldwell, Renneboog, et al., 1989 | gas phase; B |
ΔrH° | 341.1 ± 2.1 | kcal/mol | G+TS | Jinfeng, Topsom, et al., 1988 | gas phase; value altered from reference due to change in acidity scale; B |
Quantity | Value | Units | Method | Reference | Comment |
ΔrG° | 334.5 ± 2.0 | kcal/mol | IMRE | Caldwell, Renneboog, et al., 1989 | gas phase; B |
ΔrG° | 334.1 ± 2.0 | kcal/mol | IMRE | Jinfeng, Topsom, et al., 1988 | gas phase; value altered from reference due to change in acidity scale; B |

Kovats' RI, non-polar column, isothermal

Column type | Active phase | Temperature (C) | I | Reference | Comment |
---|---|---|---|---|---|
Packed | OV-101 | 200. | 1269. | Macek and Smolková-Keulemansová, 1985 | N2, Chromosorb W HP (100-120 mesh); Column length: 2. m |

Van Den Dool and Kratz RI, non-polar column, temperature ramp

Column type | Active phase | I | Reference | Comment |
---|---|---|---|---|
Capillary | HP-5MS | 1254. | Jarunrattanasri, Theerakulkait, et al., 2007 | 30. m/0.25 mm/0.5 μm, He, 35. C @ 5. min, 4. K/min, 225. C @ 30. min |
Capillary | SE-54 | 1276. | Schlutt B., Moran N., et al., 2007 | He, 40. C @ 2. min, 8. K/min, 240. C @ 5. min; Column length: 50. m; Column diameter: 0.32 mm |
Capillary | DB-5 | 1262. | Steinhaus and Schieberle, 2007 | 30. m/0.32 mm/0.25 μm, 40. C @ 2. min, 6. K/min, 240. C @ 10. min |
Capillary | DB-1 | 1251. | Osorio, Alarcon, et al., 2006 | 25. m/0.2 mm/0.33 μm, 4. K/min; Tstart: 50. C; Tend: 300. C |
Capillary | DB-5MS | 1248. | Schwambach and Peterson, 2006 | 30. m/0.25 mm/0.25 μm, H2, 30. C @ 2. min, 2. K/min, 250. C @ 2. min |
Capillary | DB-5 | 1263. | Alves, Pinto, et al., 2005 | 30. m/0.25 mm/0.25 μm, H2, 5. K/min, 270. C @ 20. min; Tstart: 35. C |
Capillary | DB-5 | 1255. | Colahan-Sederstrom and Peterson, 2005 | 30. m/0.25 mm/0.25 μm, N2, 40. C @ 2. min, 5. K/min, 230. C @ 6. min |
Capillary | DB-5MS | 1265. | Whetstine, Cadwallader, et al., 2005 | 30. m/0.25 mm/0.25 μm, 40. C @ 3. min, 10. K/min, 200. C @ 20. min |
Capillary | DB-5 | 1246. | Wu, Zorn, et al., 2005 | 30. m/0.32 mm/0.25 μm, He, 40. C @ 2. min, 5. K/min, 250. C @ 5. min |
Capillary | DB-5 | 1248. | Wu, Zorn, et al., 2005 | 30. m/0.32 mm/0.25 μm, He, 40. C @ 2. min, 5. K/min, 250. C @ 5. min |
Capillary | DB-5MS | 1265. | Karagül-Yüceer, Vlahovich, et al., 2003 | 30. m/0.25 mm/0.25 μm, He, 35. C @ 5. min, 10. K/min, 200. C @ 30. min |
Capillary | DB-5 | 1274. | Valim, Rouseff, et al., 2003 | 60. m/0.25 mm/0.25 μm, He, 7. K/min; Tstart: 40. C; Tend: 275. C |
Capillary | DB-5 | 1263. | Zhou, Wintersteen, et al., 2002 | 15. m/0.32 mm/0.5 μm, 30. C @ 2. min, 10. K/min, 225. C @ 20. min |
Capillary | DB-5 | 1265. | Karagül-Yüceer, Drake, et al., 2001 | 30. m/0.32 mm/0.25 μm, 35. C @ 5. min, 10. K/min, 200. C @ 30. min |
Packed | SE-30 | 1240. | Peng, Ding, et al., 1988 | He, Supelcoport and Chromosorb, 40. C @ 4. min, 10. K/min, 250. C @ 60. min; Column length: 3.05 m |

Van Den Dool and Kratz RI, non-polar column, custom temperature program

Column type | Active phase | I | Reference | Comment |
---|---|---|---|---|
Capillary | HP-5MS | 1246.2 | Andriamaharavo, 2014 | 30. m/0.25 mm/0.25 μm, He; Program: 60C (1 min) => 5 C/min => 210C => 10 C/min => 280C (15 min) |
Capillary | VF-5MS | 1265.9 | Tret'yakov, 2008 | 30. m/0.25 mm/0.25 μm, He; Program: Multi-step temperature program; T(initial)=60C; T(final)=270C |
Capillary | SE-54 | 1262. | Schuh and Schieberle, 2006 | 30. m/0.32 mm/0.25 μm; Program: 40C(2min) => 6C/min => 150C => 20C/min => 230C |
Capillary | DB-5 | 1256. | Klesk, Qian, et al., 2004 | 30. m/0.32 mm/1. μm, He; Program: 40C (2min) => 5C/min => 100C => 4C/min => 230C (10min) |
Capillary | DB-5 | 1267. | Jezussek, Juliano, et al., 2002 | 30. m/0.32 mm/0.25 μm, He; Program: 40C(1min) => 40C/min => 50C(2min) => 6C/min => 240C |
Capillary | SE-54 | 1265. | Zimmermann and Schieberle, 2000 | 30. m/0.25 mm/0.25 μm, He; Program: 35C(2min) => 40C/min => 60C => 6C/min => 180C 20C/min => 240C(10min) |
Capillary | SE-54 | 1263. | Derail, Hofmann, et al., 1999 | 30. m/0.32 mm/0.25 μm, He; Program: 35C (2min) => 40C/min => 50C => 4C/min => 230C (10min) |
Capillary | SE-54 | 1262. | Münch, Hofmann, et al., 1997 | 30. m/0.32 mm/0.25 μm, He; Program: 40C (2min) => 40C/min => 50C (2min) => 240C (10min) |

Van Den Dool and Kratz RI, polar column, temperature ramp

Column type | Active phase | I | Reference | Comment |
---|---|---|---|---|
Capillary | DB-FFAP | 2565. | Jarunrattanasri, Theerakulkait, et al., 2007 | 30. m/0.25 mm/0.5 μm, He, 35. C @ 5. min, 4. K/min, 225. C @ 30. min |
Capillary | DB-FFAP | 2561. | Jarunrattanasri, Theerakulkait, et al., 2007 | 30. m/0.25 mm/0.5 μm, He, 35. C @ 5. min, 4. K/min, 225. C @ 30. min |
Capillary | FFAP | 2585. | Schlutt B., Moran N., et al., 2007 | He, 40. C @ 2. min, 8. K/min, 240. C @ 5. min; Column length: 30. m; Column diameter: 0.32 mm |
Capillary | FFAP | 2540. | Steinhaus and Schieberle, 2007 | 30. m/0.32 mm/0.25 μm, 40. C @ 2. min, 6. K/min, 240. C @ 10. min |
Capillary | DB-Wax | 2543. | Osorio, Alarcon, et al., 2006 | 30. m/0.25 mm/0.25 μm, He, 50. C @ 4. min, 4. K/min, 220. C @ 20. min |
Capillary | DB-FFAP | 2569. | Schwambach and Peterson, 2006 | 30. m/0.25 mm/0.25 μm, H2, 30. C @ 2. min, 3. K/min, 230. C @ 4. min |
Capillary | DB-FFAP | 2581. | Colahan-Sederstrom and Peterson, 2005 | 30. m/0.25 mm/0.25 μm, N2, 40. C @ 2. min, 5. K/min, 230. C @ 6. min |
Capillary | Stabilwax | 2556. | Fang and Qian, 2005 | 30. m/0.32 mm/1. μm, N2, 40. C @ 2. min, 4. K/min, 230. C @ 10. min |
Capillary | DB-Wax | 2569.00 | Whetstine, Cadwallader, et al., 2005 | 30. m/0.25 mm/0.25 μm, 40. C @ 3. min, 10. K/min, 200. C @ 20. min |
Capillary | DB-Wax | 2578. | Wu, Zorn, et al., 2005 | 30. m/0.32 mm/0.25 μm, H2, 40. C @ 2. min, 5. K/min, 250. C @ 5. min |
Capillary | DB-Wax | 2581. | Wu, Zorn, et al., 2005 | 30. m/0.32 mm/0.25 μm, H2, 40. C @ 2. min, 5. K/min, 250. C @ 5. min |
Capillary | ZB-Wax | 2589. | Wu, Zorn, et al., 2005 | 30. m/0.32 mm/0.25 μm, He, 40. C @ 2. min, 5. K/min, 250. C @ 5. min |
Capillary | ZB-Wax | 2590. | Wu, Zorn, et al., 2005 | 30. m/0.32 mm/0.25 μm, He, 40. C @ 2. min, 5. K/min, 250. C @ 5. min |
Capillary | DB-FFAP | 2548. | Karagül-Yüceer, Vlahovich, et al., 2003 | 30. m/0.25 mm/0.25 μm, He, 35. C @ 5. min, 10. K/min, 200. C @ 30. min |
Capillary | DB-Wax | 2574. | Valim, Rouseff, et al., 2003 | 30. m/0.32 mm/0.5 μm, 7. K/min, 240. C @ 5. min; Tstart: 40. C |
Capillary | DB-FFAP | 2519. | Karagül-Yüceer, Cadwallader, et al., 2002 | 30. m/0.25 mm/0.25 μm, 35. C @ 5. min, 10. K/min, 200. C @ 30. min |
Capillary | DB-FFAP | 2540. | Karagül-Yüceer, Cadwallader, et al., 2002 | 30. m/0.25 mm/0.25 μm, 35. C @ 5. min, 10. K/min, 200. C @ 30. min |
Capillary | Supelcowax-10 | 2578. | Moreira, Trugo, et al., 2002 | 30. m/0.25 mm/0.25 μm, He, 3. K/min, 230. C @ 30. min; Tstart: 50. C |
Capillary | DB-FFAP | 2555. | Zhou, Wintersteen, et al., 2002 | 15. m/0.32 mm/0.25 μm, 30. C @ 2. min, 10. K/min, 225. C @ 20. min |
Capillary | HP-Innowax | 2569. | Adamiec, Rossner, et al., 2001 | 30. m/0.25 mm/0.25 μm, N2, 5. K/min; Tstart: 60. C; Tend: 220. C |
Capillary | DB-Wax | 2568. | Karagül-Yüceer, Drake, et al., 2001 | 30. m/0.25 mm/0.25 μm, 35. C @ 5. min, 10. K/min, 200. C @ 30. min |
Capillary | DB-FFAP | 2573. | Charles, Martin, et al., 2000 | 30. m/0.32 mm/0.25 μm, H2, 40. C @ 2. min, 5. K/min; Tend: 240. C |
Capillary | DB-Wax | 2521. | Shimoda, Shigematsu, et al., 1995 | 60. m/0.25 mm/0.25 μm, 2. K/min; Tstart: 50. C; Tend: 230. C |
Capillary | CP-WAX 57CB | 2568. | Baltes and Mevissen, 1988 | He, 50. C @ 5. min, 2. K/min; Column length: 50. m; Column diameter: 0.24 mm; Tend: 210. C |

Van Den Dool and Kratz RI, polar column, custom temperature program

Column type | Active phase | I | Reference | Comment |
---|---|---|---|---|
Capillary | FFAP | 2554. | Frauendorfer and Schieberle, 2006 | 25. m/0.32 mm/0.2 μm, He; Program: 40C(1min) => 40C/min => 60C(1min) => 6C/min => 180C => 15C/min => 240C |
Capillary | FFAP | 2582. | Schuh and Schieberle, 2006 | 30. m/0.32 mm/0.25 μm; Program: 40C(2min) => 6C/min => 150C => 20C/min => 230C |
Capillary | FFAP | 2561. | Fritsch and Schieberle, 2005 | 30. m/0.32 mm/0.25 μm, He; Program: 35C(2min) => 40C/min => 60C(2min) => 6C/min => 180C => 20C/min => 230C(10min) |
Capillary | FFAP | 2557. | Jezussek, Juliano, et al., 2002 | 30. m/0.25 mm/0.25 μm, He; Program: 40C(1min) => 40C/min => 50C(2min) => 6C/min => 240C |
Capillary | FFAP | 2570. | Kirchhoff and Schieberle, 2002 | 30. m/0.32 mm/0.25 μm, He; Program: 35C (2min) => 60C/min => 50C (2min) => 6C/min => 240C (10min) |
Capillary | FFAP | 2570. | Kirchhoff and Schieberle, 2002 | 30. m/0.32 mm/0.25 μm, He; Program: 35C (2min) => 60C/min => 50C (2min) => 6C/min => 240C (10min) |
Capillary | DB-Wax | 2530. | Cantergiani, Brevard, et al., 2001 | 30. m/0.25 mm/0.25 μm; Program: 20C(30s) => fast => 60C => 4C/min => 220C (20min) |
Capillary | FFAP | 2570. | Kirchhoff and Schieberle, 2001 | 30. m/0.32 mm/0.25 μm, He; Program: 40C(2min) => 40C/min => 60C(2min) => 6C/min => 240C(10min) |
Capillary | DB-FFAP | 2569. | Rychlik and Bosset, 2001 | 30. m/0.32 mm/0.25 μm, He; Program: 35C(2min) => 40C/min => 60C (2min) => 5C/min => 240C |
Capillary | FFAP | 2595. | Zimmermann and Schieberle, 2000 | 30. m/0.25 mm/0.25 μm, He; Program: 35C(2min) => 40C/min => 60C => 6C/min => 180C 20C/min => 240C(10min) |
Capillary | FFAP | 2550. | Derail, Hofmann, et al., 1999 | 30. m/0.32 mm/0.25 μm, He; Program: 35C (2min) => 40C/min => 60C => 4C/min => 230C (10min) |
Capillary | FFAP | 2550. | Derail, Hofmann, et al., 1999 | 30. m/0.32 mm/0.25 μm, He; Program: 35C (2min) => 40C/min => 60C => 4C/min => 230C (10min) |

Normal alkane RI, non-polar column, temperature ramp

Column type | Active phase | I | Reference | Comment |
---|---|---|---|---|
Capillary | HP-5 MS | 1269. | Jerkovic, Hegic, et al., 2010 | 30. m/0.25 mm/0.25 μm, Helium, 70. C @ 2. min, 3. K/min, 200. C @ 18. min |
Capillary | HP-5 MS | 1269. | Jerkovic and Marijanovic, 2010 | 30. m/0.25 mm/0.25 μm, Helium, 70. C @ 2. min, 3. K/min, 200. C @ 18. min |
Capillary | HP-5 MS | 1269. | Jerkovic, Tuberso, et al., 2010 | 30. m/0.25 mm/0.25 μm, Helium, 70. C @ 2. min, 3. K/min, 200. C @ 18. min |
Capillary | HP-5 MS | 1270. | Pino, Marquez, et al., 2010 | 30. m/0.32 mm/0.25 μm, Helium, 50. C @ 2. min, 4. K/min, 240. C @ 10. min |
Capillary | SE-54 | 1262. | Laselan, Buettner, et al., 2009 | 30. m/0.32 mm/0.25 μm, 0. C @ 2. min, 6. K/min; Tend: 200. C |
Capillary | HP-5 MS | 1252. | Radulovic, Blagojevic, et al., 2009 | 30. m/0.25 mm/0.25 μm, Helium, 5. K/min, 290. C @ 10. min; Tstart: 70. C |
Capillary | BPX5 | 1279. | Boustie, Rapior, et al., 2005 | 25. m/0.20 mm/0.13 μm, He, 50. C @ 2. min, 3. K/min; Tend: 230. C |
Capillary | HP-5 | 1251. | N/A | 30. m/0.32 mm/0.25 μm, Helium, 40. C @ 2. min, 5. K/min, 250. C @ 5. min |
Capillary | HP-5 | 1257. | N/A | 30. m/0.32 mm/0.25 μm, Helium, 40. C @ 2. min, 5. K/min, 250. C @ 5. min |
Capillary | DB-5 | 1257. | Wu, Krings, et al., 2005 | 30. m/0.32 mm/0.25 μm, He, 40. C @ 2. min, 5. K/min, 250. C @ 10. min |
Capillary | DB-5 | 1257. | Wu, Krings, et al., 2005 | 30. m/0.32 mm/0.25 μm, He, 40. C @ 2. min, 5. K/min, 250. C @ 10. min |
Capillary | AT-1 | 1252. | Kelling, 2001 | He, 50. C @ 2. min, 10. K/min; Tend: 300. C |
Capillary | DB-5MS | 1262. | Suriyaphan, Drake, et al., 2001 | 30. m/0.32 mm/0.25 μm, He, 40. C @ 5. min, 5. K/min, 195. C @ 40. min |
Capillary | HP-1 | 1236. | Ong and Acree, 1999 | 4. K/min; Column length: 25. m; Column diameter: 0.20 mm; Tstart: 35. C; Tend: 250. C |
Capillary | HP-1 | 1236. | Ong and Acree, 1998 | 4. K/min; Column length: 25. m; Column diameter: 0.32 mm; Tstart: 35. C; Tend: 250. C |
Capillary | HP-1 | 1236. | Ong, Acree, et al., 1998 | 4. K/min; Column length: 25. m; Column diameter: 0.32 mm; Tstart: 35. C; Tend: 250. C |
Capillary | BPX-5 | 1264. | D'Arcy, Rintoul, et al., 1997 | 50. m/0.22 mm/0.25 μm, He, 50. C @ 1. min, 3. K/min, 250. C @ 10. min |

Normal alkane RI, non-polar column, custom temperature program

Column type | Active phase | I | Reference | Comment |
---|---|---|---|---|
Capillary | HP-5 MS | 1268. | Pino, Marquez, et al., 2010 | 30. m/0.32 mm/0.25 μm, Helium; Program: not specified |
Capillary | SE-54 | 1262. | Christlbauer and Schieberle, 2009 | 30. m/0.32 mm/0.25 μm, Helium; Program: 35 0C (2 min) 10 0C/min -> 50 0C (2 min) 6 0C/min -> 250 0C |
Capillary | DB-5 | 1262. | Buettner, 2007 | 30. m/0.32 mm/0.25 μm; Program: 40C(2min) => 40C/min => 60C(2min) => 6C/min => 180C => 15C/min => 230C(10min) |
Capillary | SE-54 | 1262. | Lasekan, Buettner, et al., 2007 | 30. m/0.32 mm/0.25 μm; Program: 35C(2min) => 40C/min => 60C(2min) => 6C/min => 180C => 10C/min => 230C(10min) |
Capillary | HP-5MS | 1276. | Alissandrakis, Kibaris, et al., 2005 | 30. m/0.25 mm/0.25 μm, He; Program: 40C(3min) => 2C/min => 180C => 10C/min => 250C(5min) |
Capillary | SE-54 | 1262. | Buettner, 2004 | 30. m/0.32 mm/0.25 μm, He; Program: 40C(2min) => 40C/min => 50C(2min) => 6C/min => 180C => 15C/min => 230C (10min) |
Capillary | MFE-73 | 1249. | Escudero, Gogorza, et al., 2004 | Program: not specified |
Capillary | MFE-73 | 1249. | Ferreira, Ortín, et al., 2002 | H2; Program: not specified |
Capillary | MFE-73 | 1249. | Aznar, López, et al., 2001 | 30. m/0.32 mm/0.1 μm, H2; Program: 40C(5min) => 2C/min => 120C => 10C/min => 210C(30min) |
Capillary | MFE-73 | 1249. | Ferreira, Aznar, et al., 2001 | 30. m/0.32 mm/0.1 μm, H2; Program: 40 C (5min) => 2C/min => 120C => 10 C/min => 210 C (30min) |
Capillary | CP Sil 5 CB | 1233. | Lermusieau, Bulens, et al., 2001 | 50. m/0.32 mm/1.2 μm; Program: 36C => 20C/min => 120C(20min) => 2C/min => 250C(30min) |
Capillary | CP Sil 5 CB | 1230. | Guyot, Scheirman, et al., 1999 | He; Column length: 50. m; Column diameter: 0.32 mm; Program: 30C => 55C/min => 85C => 1C/min => 145C => 3C/min => 250C |
Capillary | CP Sil 5 CB | 1212. | Guyot, Bouseta, et al., 1998 | 50. m/0.32 mm/1.2 μm, He; Program: 30C => 55C/min => 85C => 1C/min => 145C => 3C/min => 250C |
Capillary | SE-54 | 1262. | Schermann and Schieberle, 1997 | 30. m/0.32 mm/0.25 μm, He; Program: 35C (2min) => 40C/min => 60C (2min) => 6C/min => 180C => 10C/min => 240C |

Normal alkane RI, polar column, temperature ramp

Column type | Active phase | I | Reference | Comment |
---|---|---|---|---|
Capillary | DB-Wax | 2528. | Onishi, Inoue, et al., 2011 | 60. m/0.25 mm/0.25 μm, Helium, 50. C @ 2. min, 3. K/min, 220. C @ 20. min |
Capillary | FFAP | 2545. | Piyachaiseth, Jirapakkul, et al., 2011 | 60. m/0.25 mm/0.25 μm, Helium, 45. C @ 1. min, 5. K/min, 220. C @ 5. min |
Capillary | DB-Wax | 2553. | Kumazawa, Sakai, et al., 2010 | 30. m/0.25 mm/0.25 μm, Helium, 3. K/min; Tstart: 40. C; Tend: 210. C |
Capillary | CP Wax 52 CB | 2560. | Birtic, Ginies, et al., 2009 | 30. m/0.32 mm/0.50 μm, Helium, 40. C @ 2. min, 4. K/min, 230. C @ 15. min |
Capillary | FFAP | 2551. | Christlbauer and Schieberle, 2009 | 30. m/0.32 mm/0.25 μm, Helium, 40. C @ 2. min, 6. K/min; Tend: 240. C |
Capillary | RTX-Wax | 2539. | Prososki, Etzel, et al., 2007 | 30. m/0.25 mm/0.5 μm, He, 40. C @ 5. min, 10. K/min, 220. C @ 10. min |
Capillary | DB-Wax | 2550. | Xu, Fan, et al., 2007 | 30. m/0.25 mm/0.25 μm, He, 40. C @ 2. min, 4. K/min, 230. C @ 5. min |
Capillary | DB-Wax | 2550. | Fan and Qian, 2006 | 30. m/0.32 mm/0.25 μm, He, 40. C @ 2. min, 4. K/min, 230. C @ 15. min |
Capillary | DB-Wax Etr | 2578. | Ibarz, Ferreira, et al., 2006 | 60. m/0.25 mm/0.25 μm, He, 40. C @ 5. min, 2. K/min, 230. C @ 100. min |
Capillary | ZB-Wax | 2592. | N/A | 30. m/0.32 mm/0.25 μm, Helium, 40. C @ 2. min, 5. K/min, 250. C @ 5. min |
Capillary | ZB-Wax | 2601. | N/A | 30. m/0.32 mm/0.25 μm, Helium, 40. C @ 2. min, 5. K/min, 250. C @ 5. min |
Capillary | DB-Wax | 2601. | Wu, Krings, et al., 2005 | 30. m/0.32 mm/0.25 μm, H2, 40. C @ 2. min, 5. K/min, 230. C @ 15. min |
Capillary | DB-Wax | 2585. | Culleré, Escudero, et al., 2004 | 30. m/0.32 mm/0.5 μm, H2, 40. C @ 5. min, 4. K/min; Tend: 200. C |
Capillary | DB-Wax | 2575. | López, Ezpeleta, et al., 2004 | 60. m/0.25 mm/0.25 μm, He, 40. C @ 5. min, 3. K/min; Tend: 220. C |
Capillary | DB-Wax | 2597. | López, Ortín, et al., 2003 | 30. m/0.32 mm/0.5 μm, H2, 40. C @ 5. min, 4. K/min; Tend: 200. C |
Capillary | DB-FFAP | 2548. | Czerny and Schieberle, 2002 | 30. m/0.32 mm/0.25 μm, He, 40. C @ 2. min, 6. K/min, 230. C @ 10. min |
Capillary | DB-FFAP | 2548. | Czerny and Schieberle, 2002 | 30. m/0.32 mm/0.25 μm, He, 40. C @ 2. min, 6. K/min, 230. C @ 10. min |
Capillary | DB-Wax | 2585. | Ferreira, Ortín, et al., 2002 | 30. m/0.32 mm/0.5 μm, H2, 40. C @ 5. min, 4. K/min; Tend: 200. C |
Capillary | DB-Wax | 2571. | Aznar, López, et al., 2001 | 30. m/0.32 mm/0.5 μm, H2, 40. C @ 5. min, 4. K/min, 200. C @ 60. min |
Capillary | EC-1000 | 2565. | Bendall, 2001 | 30. m/0.25 mm/0.25 μm, He, 35. C @ 5. min, 5. K/min, 230. C @ 15. min |
Capillary | DB-Wax | 2571. | Ferreira, Aznar, et al., 2001 | 30. m/0.32 mm/0.5 μm, H2, 40. C @ 5. min, 4. K/min, 200. C @ 60. min |
Capillary | DB-FFAP | 2569. | Suriyaphan, Drake, et al., 2001 | 30. m/0.32 mm/0.25 μm, He, 40. C @ 5. min, 5. K/min, 195. C @ 40. min |
Capillary | DB-Wax | 2546. | Wei, Mura, et al., 2001 | 60. m/0.25 mm/0.25 μm, He, 2. K/min; Tstart: 40. C; Tend: 200. C |
Capillary | DB-Wax | 2534. | Kotseridis and Baumes, 2000 | 30. m/0.32 mm/0.5 μm, H2, 60. C @ 3. min, 3. K/min, 245. C @ 20. min |
Capillary | DB-Wax | 2534. | Kotseridis and Baumes, 2000 | 30. m/0.32 mm/0.5 μm, H2, 60. C @ 3. min, 3. K/min, 245. C @ 20. min |
Capillary | DB-Wax | 2550. | Iwatsuki, Mizota, et al., 1999 | 4. K/min; Column length: 30. m; Column diameter: 0.53 mm; Tstart: 60. C; Tend: 210. C |
Capillary | HP-Innowax | 2568. | Ong and Acree, 1999 | 4. K/min; Column length: 25. m; Column diameter: 0.25 mm; Tstart: 35. C; Tend: 250. C |
Capillary | HP-Innowax | 2568. | Ong and Acree, 1998 | 4. K/min; Column length: 25. m; Column diameter: 0.32 mm; Tstart: 35. C; Tend: 250. C |
Capillary | HP-Innowax | 2568. | Ong, Acree, et al., 1998 | 4. K/min; Column length: 25. m; Column diameter: 0.32 mm; Tstart: 35. C; Tend: 250. C |
Capillary | TC-Wax | 2610. | Shuichi, Masazumi, et al., 1996 | 80. C @ 5. min, 3. K/min; Column length: 60. m; Column diameter: 0.25 mm; Tend: 240. C |

Normal alkane RI, polar column, custom temperature program

Column type | Active phase | I | Reference | Comment |
---|---|---|---|---|
Capillary | DB-Wax | 2560. | Sampaio, Garruti, et al., 2011 | 30. m/0.25 mm/0.25 μm, Hydrogen; Program: 35 0C (9 min) 5 0C/min -> 80 0C 1 0C/min -> 100 0C 16 0C/min -> 210 0C (20 min) |
Capillary | Stabilwax | 2574. | Chinnici, Guerrero, et al., 2009 | 30. m/0.25 mm/0.25 μm, Helium; Program: 35 0C 3 0C/min -> 100 0C 5 0C/min -> 240 0C (10 min) |
Capillary | FFAP | 2519. | Frauendorfer and Schieberle, 2008 | Helium; Program: not specified |
Capillary | SOLGel-Wax | 2566. | Shu and Shen, 2008 | 30. m/0.53 mm/0.50 μm, Helium; Program: 40 0C 7 0C/min -> 180 0C 10 0C/min -> 240 0C (10 min) |
Capillary | SOLGel-Wax | 2564. | Shu and Shen, 2008 | 30. m/0.53 mm/0.50 μm, Helium; Program: not specified |
Capillary | DB-FFAP | 2551. | Buettner, 2007 | 30. m/0.32 mm/0.25 μm; Program: 40C(2min) => 40C/min => 60C(2min) => 6C/min => 180C => 15C/min => 230C(10min) |
Capillary | DB-FFAP | 2577. | Lasekan, Buettner, et al., 2007 | 30. m/0.32 mm/0.25 μm; Program: 35C(2min) => 40C/min => 50C(2min) => 6C/min => 180C => 10C/min => 230C(10min) |
Capillary | DB-Wax | 2553. | Krings, Zelena, et al., 2006 | 30. m/0.32 mm/0.25 μm, He; Program: 45C(5min) => 5C/min => 150C => 10C/min => 240C (10min) |
Capillary | DB-Wax | 2553. | Krings, Zelena, et al., 2006 | 30. m/0.32 mm/0.25 μm, He; Program: 45C(5min) => 5C/min => 150C => 10C/min => 240C (10min) |
Capillary | CP-Wax 58CB | 2548. | Tokitomo, Steihaus, et al., 2005 | 25. m/0.32 mm/0.20 μm, Helium; Program: 40 0C (2 min) 40 0C/min -> 60 0C (1 min) 6 0C/min -> 180 0C 10 0C/min -> 240 0C (5 min) |
Capillary | DB-FFAP | 2551. | Buettner, 2004 | 30. m/0.32 mm/0.25 μm, He; Program: 40C(2min) => 40C/min => 60C(2min) => 6C/min => 180C => 15C/min => 230C (10min) |
Capillary | DB-Wax | 2585. | Escudero, Gogorza, et al., 2004 | Program: not specified |
Capillary | FFAP | 2538. | Zehentbauer and Grosch, 1998 | 25. m/0.32 mm/0.25 μm, He; Program: 35C(2min) => 40C/min => 60C(2min) => 6C/min => 230C |
Capillary | FFAP | 2555. | Schieberle and Grosch, 1994 | He; Column length: 30. m; Column diameter: 0.32 mm; Program: 35C => 40C/min => 60C(2min) => 4C/min => 240C |

Lee's RI, non-polar column, custom temperature program

Column type | Active phase | I | Reference | Comment |
---|---|---|---|---|
Capillary | Methyl Silicone | 216.16 | Eckel, Ross, et al., 1993 | Program: not specified |

References

Wrede, 1911
Wrede, F.,
Uber die Bestimmung von Berbrennungswarmen mittels der kalorimetrischen Bombe unter Benutzung des Platinwiderstandsthermometers,
Z. Phys. Chem. (Leipzig), 1911, 81-94. [all data]
Auwers and Roth, 1910
Auwers, K.; Roth, W.A.,
Thermochemische Untersuchungen. I. Uber Beziehungen zwischen Konstitution und Verbrennungswarme ungesattigter Verbindungen,
Justus Liebigs Ann. Chem., 1910, 239-248. [all data]
Fischer and Wrede, 1904
Fischer, E.; Wrede, F.,
Uber die Verbrennungswarme einiger organischer Verbindungen,
Sitzungsber. Dtsch. Akad. Wiss. Berlin Kl. Math. Phys. Tech., 1904, 687-715. [all data]
Lemoult, 1904
Lemoult, M.P.,
Remarques sur une serie recenie de determinations calorimetriques,
Compt. Rend., 1904, 663-635. [all data]
Weast and Grasselli, 1989
CRC Handbook of Data on Organic Compounds, 2nd Editon, Weast,R.C and Grasselli, J.G., ed(s)., CRC Press, Inc., Boca Raton, FL, 1989, 1. [all data]
Henne and Hill, 1943
Henne, A.L.; Hill, P.,
The Preparatioon of Aldehydes, Ketones, and Acids by Ozone Oxidation,
J. Am. Chem. Soc., 1943, 65, 752-4. [all data]
Adams and Marshall, 1928
Adams, R.; Marshall, J.R.,
The Use of Platinum-Oxide Platinum Black in the Catalytic Reduction of Aromatic Hydrocarbons XVII.,
J. Am. Chem. Soc., 1928, 50, 1970. [all data]
Robertson, 1902
Robertson, P.W.,
Atomic and molecular heats of fusion.,
J. Chem. Soc., 1902, 81, 1233. [all data]
Bruner, 1894
Bruner, L.,
The heats of fusion of some organic compounds,
Ber. Dtsch. Chem. Ges., 1894, 27, 2102. [all data]
Roux *, Temprado, et al., 2004
Roux *, Maria Victoria; Temprado, Manuel; Notario, Rafael; Verevkin, Sergey P.; Emel'yanenko, Vladimir N.; Demasters, Douglas E.; Liebman, Joel F.,
The energetics of naphthalene derivatives, III: phenylacetic acid and the isomeric 1- and 2-naphthylacetic acids,
Molecular Physics, 2004, 102, 18, 1909-1917, https://doi.org/10.1080/00268970412331284262
. [all data]
Monte and Hillesheim, 2001
Monte, Manuel J.S.; Hillesheim, Dorothea M.,
Thermodynamic Study on the Sublimation of 2-Phenylacetic, 4-Phenylbutyric, and 5-Phenylvaleric Acid,
J. Chem. Eng. Data, 2001, 46, 6, 1601-1604, https://doi.org/10.1021/je010153h
. [all data]
Stephenson and Malanowski, 1987
Stephenson, Richard M.; Malanowski, Stanislaw,
Handbook of the Thermodynamics of Organic Compounds, 1987, https://doi.org/10.1007/978-94-009-3173-2
. [all data]
Gracin and Rasmuson, 2002
Gracin, Sandra; Rasmuson, Åke C.,
Solubility of Phenylacetic Acid, p -Hydroxyphenylacetic Acid, p -Aminophenylacetic Acid, p -Hydroxybenzoic Acid, and Ibuprofen in Pure Solvents,
J. Chem. Eng. Data, 2002, 47, 6, 1379-1383, https://doi.org/10.1021/je0255170
. [all data]
Acree, 1991
Acree, William E.,
Thermodynamic properties of organic compounds: enthalpy of fusion and melting point temperature compilation,
Thermochimica Acta, 1991, 189, 1, 37-56, https://doi.org/10.1016/0040-6031(91)87098-H
. [all data]
Sharma, Kant, et al., 2003
Sharma, B.L.; Kant, Rajesh; Sharma, Ritu; Tandon, Sonika,
Deviations of binary organic eutectic melt systems,
Materials Chemistry and Physics, 2003, 82, 1, 216-224, https://doi.org/10.1016/S0254-0584(03)00199-8
. [all data]
Caldwell, Renneboog, et al., 1989
Caldwell, G.; Renneboog, R.; Kebarle, P.,
Gas Phase Acidities of Aliphatic Carboxylic Acids, Based on Measurements of Proton Transfer Equilibria,
Can. J. Chem., 1989, 67, 4, 661, https://doi.org/10.1139/v89-092
. [all data]
Jinfeng, Topsom, et al., 1988
Jinfeng, C.; Topsom, R.D.; Headley, A.D.; Koppel, I.; Mishima, M.; Taft, R.W.; Veji, S.,
Acidities of Substituted Acetic Acids,
J. Mol. Struct., 1988, 168, 141, https://doi.org/10.1016/0166-1280(88)80349-X
. [all data]
Klasinc, Kovac, et al., 1983
Klasinc, L.; Kovac, B.; Gusten, H.,
Photoelectron spectra of acenes. Electronic structure and substituent effects,
Pure Appl. Chem., 1983, 55, 289. [all data]
Meeks, Wahlborg, et al., 1981
Meeks, J.; Wahlborg, A.; McGlynn, S.P.,
Photoelectron spectroscopy of carbonyls: Benzoic acid and its derivatives,
J. Electron Spectrosc. Relat. Phenom., 1981, 22, 43. [all data]
Macek and Smolková-Keulemansová, 1985
Macek, J.; Smolková-Keulemansová, E.,
Correlation of the chromatographic retention of some phenylacetic and phenylpropionic acid derivatives with molecular structure,
J. Chromatogr., 1985, 333, 309-317, https://doi.org/10.1016/S0021-9673(01)87361-1
. [all data]
Jarunrattanasri, Theerakulkait, et al., 2007
Jarunrattanasri, A.; Theerakulkait, C.; Cadwallader, K.R.,
Aroma Components of Acid-Hydrolyzed Vegetable Protein Made by Partial Hydrolysis of Rice Bran Protein,
J. Agric. Food Chem., 2007, 55, 8, 3044-3050, https://doi.org/10.1021/jf0631474
. [all data]
Schlutt B., Moran N., et al., 2007
Schlutt B.; Moran N.; Schieberle P.; Hofmann T.,
Sensory-directed identification of creaminess-enhancing volatiles and semivolatiles in full-fat cream,
J. Agric. Food Chem., 2007, 55, 23, 9634-9645, https://doi.org/10.1021/jf0721545
. [all data]
Steinhaus and Schieberle, 2007
Steinhaus, P.; Schieberle, P.,
Characterization of the key aroma compounds in soy sauce using approaches of molecular sensory science,
J. Agric. Food Chem., 2007, 55, 15, 6262-6269, https://doi.org/10.1021/jf0709092
. [all data]
Osorio, Alarcon, et al., 2006
Osorio, C.; Alarcon, M.; Moreno, C.; Bonilla, A.; Barrios, J.; Garzon, C.; Duque, C.,
Characterization of Odor-Active Volatiles in Champa ( Campomanesia lineatifolia R. P.),
J. Agric. Food Chem., 2006, 54, 2, 509-516, https://doi.org/10.1021/jf052098c
. [all data]
Schwambach and Peterson, 2006
Schwambach, S.L.; Peterson, D.G.,
Reduction of Stale Flavor Development in Low-Heat Skim Milk Powder via Epicatechin Addition,
J. Agric. Food Chem., 2006, 54, 2, 502-508, https://doi.org/10.1021/jf0519764
. [all data]
Alves, Pinto, et al., 2005
Alves, R.J.V.; Pinto, A.C.; da Costa, A.V.M.; Rezende, C.M.,
Zizyphus mauritiana Lam. (Rhamnaceae) and the chemical composition of its floral fecal odor,
J. Braz. Chem. Soc., 2005, 16, 3B, 654-656, https://doi.org/10.1590/S0103-50532005000400027
. [all data]
Colahan-Sederstrom and Peterson, 2005
Colahan-Sederstrom, P.M.; Peterson, D.G.,
Inhibition of key aroma compound generated during ultrahigh-temperature processing of bovine milk via epicatechin addition,
J. Agric. Food Chem., 2005, 53, 2, 398-402, https://doi.org/10.1021/jf0487248
. [all data]
Whetstine, Cadwallader, et al., 2005
Whetstine, M.E.C.; Cadwallader, K.R.; Drake, M.A.,
Characterization of aroma compounds responsible for the rosy/floral flavor in cheddar cheese,
J. Agric. Food Chem., 2005, 53, 8, 3126-3132, https://doi.org/10.1021/jf048278o
. [all data]
Wu, Zorn, et al., 2005
Wu, S.; Zorn, H.; Krings, U.; Berger, R.G.,
Characteristic Volatiles from Young and Aged Fruiting Bodies of Wild Polyporus sulfureus (Bull.:Fr.) Fr.,
J. Agric. Food Chem., 2005, 53, 11, 4524-4528, https://doi.org/10.1021/jf0478511
. [all data]
Karagül-Yüceer, Vlahovich, et al., 2003
Karagül-Yüceer, Y.; Vlahovich, K.N.; Drake, M.A.; Cadwallader, K.R.,
Characteristic aroma components of rennet casein,
J. Agric. Food Chem., 2003, 51, 23, 6797-6801, https://doi.org/10.1021/jf0345806
. [all data]
Valim, Rouseff, et al., 2003
Valim, M.F.; Rouseff, R.L.; Lin, J.,
Gas chromatographic-olfactometric characterization of aroma compounds in two types of cashew apple nectar,
J. Agric. Food Chem., 2003, 51, 4, 1010-1015, https://doi.org/10.1021/jf025738+
. [all data]
Zhou, Wintersteen, et al., 2002
Zhou, Q.; Wintersteen, C.L.; Cadwallader, K.R.,
Identification and quantification of aroma-active components that contribute to the distinct malty flavor of buckwheat honey,
J. Agric. Food Chem., 2002, 50, 7, 2016-2021, https://doi.org/10.1021/jf011436g
. [all data]
Karagül-Yüceer, Drake, et al., 2001
Karagül-Yüceer, Y.; Drake, M.; Cadwallader, K.R.,
Aroma-active components of nonfat dry milk,
J. Agric. Food Chem., 2001, 49, 6, 2948-2953, https://doi.org/10.1021/jf0009854
. [all data]
Peng, Ding, et al., 1988
Peng, C.T.; Ding, S.F.; Hua, R.L.; Yang, Z.C.,
Prediction of Retention Indexes I. Structure-Retention Index Relationship on Apolar Columns,
J. Chromatogr., 1988, 436, 137-172, https://doi.org/10.1016/S0021-9673(00)94575-8
. [all data]
Andriamaharavo, 2014
Andriamaharavo, N.R.,
Retention Data. NIST Mass Spectrometry Data Center., NIST Mass Spectrometry Data Center, 2014. [all data]
Tret'yakov, 2008
Tret'yakov, K.V.,
Retention Data. NIST Mass Spectrometry Data Center., NIST Mass Spectrometry Data Center, 2008. [all data]
Schuh and Schieberle, 2006
Schuh, C.; Schieberle, P.,
Characterization of the Key Aroma Compounds in the Beverage Prepared from Darjeeling Black Tea: Quantitative Differences between Tea Leaves and Infusion,
J. Agric. Food Chem., 2006, 54, 3, 916-924, https://doi.org/10.1021/jf052495n
. [all data]
Klesk, Qian, et al., 2004
Klesk, K.; Qian, M.; Martin, R.R.,
Aroma extract dilution analysis of cv. meeker (Rubus idaeus L.) red raspberries from Oregon and Washington,
J. Agric. Food Chem., 2004, 52, 16, 5155-5161, https://doi.org/10.1021/jf0498721
. [all data]
Jezussek, Juliano, et al., 2002
Jezussek, M.; Juliano, B.O.; Schieberle, P.,
Comparison of key aroma compounds in cooked brown rice varieties based on aroma extract dilution analysis,
J. Agric. Food Chem., 2002, 50, 5, 1101-1105, https://doi.org/10.1021/jf0108720
. [all data]
Zimmermann and Schieberle, 2000
Zimmermann, M.; Schieberle, P.,
Important odorants of sweet bell pepper powder (Capsicum annuum cv. annuum): differences between samples of Hungarian and Morrocan origin,
Eur. Food Res. Technol., 2000, 211, 3, 175-180, https://doi.org/10.1007/s002170050019
. [all data]
Derail, Hofmann, et al., 1999
Derail, C.; Hofmann, T.; Schieberle, P.,
Differences in key odorants of handmade juice of yellow-flesh peaches (Prunus persica L.) induced by the workup procedure,
J. Agric. Food Chem., 1999, 47, 11, 4742-4745, https://doi.org/10.1021/jf990459g
. [all data]
Münch, Hofmann, et al., 1997
Münch, P.; Hofmann, T.; Schieberle, P.,
Comparison of key odorants generated by thermal treatment of commercial and self-prepared yeast extracts: influence of the amino acid composition on odorant formation,
J. Agric. Food Chem., 1997, 45, 4, 1338-1344, https://doi.org/10.1021/jf960658p
. [all data]
Fang and Qian, 2005
Fang, Y.; Qian, M.,
Aroma compounds in Oregon Pinot Noir wine determined by aroma extract dilution analysis (AEDA),
Flavour Fragr. J., 2005, 20, 1, 22-29, https://doi.org/10.1002/ffj.1551
. [all data]
Karagül-Yüceer, Cadwallader, et al., 2002
Karagül-Yüceer, Y.; Cadwallader, K.R.; Drake, M.A.,
Volatile flavor components of stored nonfat dry milk,
J. Agric. Food Chem., 2002, 50, 2, 305-312, https://doi.org/10.1021/jf010648a
. [all data]
Moreira, Trugo, et al., 2002
Moreira, R.F.A.; Trugo, L.C.; Pietroluongo, M.; de Maria, C.A.B.,
Flavor composition of cashew (Anacardium occidentale) and marmeleiro (Croton species) honeys,
J. Agric. Food Chem., 2002, 50, 26, 7616-7621, https://doi.org/10.1021/jf020464b
. [all data]
Adamiec, Rossner, et al., 2001
Adamiec, J.; Rossner, J.; Velisek, J.; Cejpek, K.; Savel, J.,
Minor Strecker degradation products of phenylalanine and phenylglycine,
Eur. Food Res. Technol., 2001, 212, 2, 135-140, https://doi.org/10.1007/s002170000234
. [all data]
Charles, Martin, et al., 2000
Charles, M.; Martin, B.; Ginies, C.; Etievant, P.; Coste, G.; Guichard, E.,
Potent aroma compounds of two red wine vinegars,
J. Agric. Food Chem., 2000, 48, 1, 70-77, https://doi.org/10.1021/jf9905424
. [all data]
Shimoda, Shigematsu, et al., 1995
Shimoda, M.; Shigematsu, H.; Shiratsuchi, H.; Osajima, Y.,
Comparison of the odor concentrates by SDE and adsorptive column method from green tea infusion,
J. Agric. Food Chem., 1995, 43, 6, 1616-1620, https://doi.org/10.1021/jf00054a037
. [all data]
Baltes and Mevissen, 1988
Baltes, W.; Mevissen, L.,
Model reactions on roast aroma formation. VI. Volatile reaction products from the reaction of phenylalanine with glucose during cooking and roasting,
Z. Lebensm. Unters. Forsch., 1988, 187, 3, 209-214, https://doi.org/10.1007/BF01043341
. [all data]
Frauendorfer and Schieberle, 2006
Frauendorfer, F.; Schieberle, P.,
Identification of the key aroma compounds in Cocoa powder based on molecular sensoly correlations,
J. Agr. Food Chem., 2006, 54, 15, 5521-5529, https://doi.org/10.1021/jf060728k
. [all data]
Fritsch and Schieberle, 2005
Fritsch, H.T.; Schieberle, P.,
Identification based on quantitative measurements and aroma recombination of the character impact odorants in a Bavarian Pilsner-type beer,
J. Agric. Food Chem., 2005, 53, 19, 7544-7551, https://doi.org/10.1021/jf051167k
. [all data]
Kirchhoff and Schieberle, 2002
Kirchhoff, E.; Schieberle, P.,
Quantitation of odor-active compounds in rye flour and rye sourdough using stable isotope dilution assays,
J. Agric. Food Chem., 2002, 50, 19, 5378-5385, https://doi.org/10.1021/jf020236h
. [all data]
Cantergiani, Brevard, et al., 2001
Cantergiani, E.; Brevard, H.; Krebs, Y.; Feria-Morales, A.; Amadò, R.; Yeretzian, C.,
Characterisation of the aroma of green Mexican coffee and identification of mouldy/earthy defect,
Eur. Food Res. Technol., 2001, 212, 6, 648-657, https://doi.org/10.1007/s002170100305
. [all data]
Kirchhoff and Schieberle, 2001
Kirchhoff, E.; Schieberle, P.,
Determination of key aroma compounds in the crumb of a three-stage sourdough rye bread by stable isotope dilution assays and sensory studies,
J. Agric. Food Chem., 2001, 49, 9, 4304-4311, https://doi.org/10.1021/jf010376b
. [all data]
Rychlik and Bosset, 2001
Rychlik, M.; Bosset, J.O.,
Flavour and off-flavour compoundsof SwissGruy ere cheese. Evaluation of potent odorants,
Int. Dairy J., 2001, 11, 11-12, 895-901, https://doi.org/10.1016/S0958-6946(01)00108-X
. [all data]
Jerkovic, Hegic, et al., 2010
Jerkovic, I.; Hegic, G.; Marijanovic, Z.; Bubalo, D.,
Organic extractives from Mentha spp. honey and the bee-stomach: methyl syringate, vomifoliol, terpenediol I, hotrienol, and other compounds,
Molecules, 2010, 15, 4, 2911-2924, https://doi.org/10.3390/molecules15042911
. [all data]
Jerkovic and Marijanovic, 2010
Jerkovic, I.; Marijanovic, Z.,
Oak (Quercus frainetto Ten.) honeydaw honey - approach to screening of volatile organic composition and antioxidant capacity (DPPH and FRAP assay),
Molecules, 2010, 15, 5, 3744-3756, https://doi.org/10.3390/molecules15053744
. [all data]
Jerkovic, Tuberso, et al., 2010
Jerkovic, I.; Tuberso, C.I.G.; Gugic, M.; Bubalo, D.,
Composition of Sulla (Hedysarum coronarium L.) honey solvent extractives determined by GC/MS: norisoprenoids and other volatile organic compounds,
Molecules, 2010, 15, 9, 6375-6385, https://doi.org/10.3390/molecules15096375
. [all data]
Pino, Marquez, et al., 2010
Pino, J.A.; Marquez, E.; Quijano, C.E.; Castro, D.,
Volatile compounds in noni (Morinda citrifolia L.) at two ripening stages,
Ciencia e Technologia de Alimentos, 2010, 30, 1, 183-187, https://doi.org/10.1590/S0101-20612010000100028
. [all data]
Laselan, Buettner, et al., 2009
Laselan, P.; Buettner, A.; Christlbauer, M.,
Investigation of the retronasal perseption of palm wine (Elaeis guineensis) aroma by application of sensory analysis and exhaled odorant measurement (EXOM),
African J. of Food, Agriculture, Nutrition and development, 2009, 9, 2, 793-813. [all data]
Radulovic, Blagojevic, et al., 2009
Radulovic, N.S.; Blagojevic, P.D.; Palic, R.M.; Zlatkovic, B.K.; Stevanovic, B.M.,
Volatiles from vegetative organs of the paleoendemic resurrection plants Ramonda serbica Panc. and Ramonda nathaliae Panc. at Petrov,
J. Serb. Chem. Soc., 2009, 74, 1, 35-44, https://doi.org/10.2298/JSC0901035R
. [all data]
Boustie, Rapior, et al., 2005
Boustie, J.; Rapior, S.; Fortin, H.; Tomas, S.; Bessiere, J.-M.,
Chemotaxonomic interest of volatile components in Lepista inversa and Lepista flaccida distinctions,
Cryptogamie, Mycologie, 2005, 26, 1, 1-4. [all data]
Wu, Krings, et al., 2005
Wu, S.; Krings, U.; Zorn, H.; Berger, R.G.,
Volatile compounds from the fruiting bodies of beefsteak fungus Fistulina hepatica (Schaeffer: Fr.) Fr.,
Food Chem., 2005, 92, 2, 221-226, https://doi.org/10.1016/j.foodchem.2004.07.013
. [all data]
Kelling, 2001
Kelling, F.J.,
Olfaction in houseflies: morphology and electrophysiology. Chapter 7. Chemical and electrophysiological analysis of components, present in natural products that attract houseflies, Dissertation, University of Groningen, The Netherlands, 2001. [all data]
Suriyaphan, Drake, et al., 2001
Suriyaphan, O.; Drake, M.; Chen, X.Q.; Cadwallader, K.R.,
Characteristic aroma components of British farmhouse cheddar cheese,
J. Agric. Food Chem., 2001, 49, 3, 1382-1387, https://doi.org/10.1021/jf001121l
. [all data]
Ong and Acree, 1999
Ong, P.K.C.; Acree, T.E.,
Similarities in the aroma chemistry of Gewürztraminer variety wines and lychee (Litchi chinesis Sonn.) fruit,
J. Agric. Food Chem., 1999, 47, 2, 665-670, https://doi.org/10.1021/jf980452j
. [all data]
Ong and Acree, 1998
Ong, P.K.C.; Acree, T.E.,
Gas chromatography/olfactory analysis of lychee (Litchi chinesis Sonn.),
J. Agric. Food Chem., 1998, 46, 6, 2282-2286, https://doi.org/10.1021/jf9801318
. [all data]
Ong, Acree, et al., 1998
Ong, P.K.C.; Acree, T.E.; Lavin, E.H.,
Characterization of volatiles in rambutan fruit (Nephelium lappaceum L.),
J. Agric. Food Chem., 1998, 46, 2, 611-615, https://doi.org/10.1021/jf970665t
. [all data]
D'Arcy, Rintoul, et al., 1997
D'Arcy, B.R.; Rintoul, G.B.; Rowland, C.Y.; Blackman, A.J.,
Composition of Australian honey extractives. 1. Norisoprenoids, monoterpenes, and other natural volatiles from blue gum (Eucalyptus leucoxylon) and yellow box (Eucalyptus melliodora) honeys,
J. Agric. Food Chem., 1997, 45, 5, 1834-1843, https://doi.org/10.1021/jf960625+
. [all data]
Christlbauer and Schieberle, 2009
Christlbauer, M.; Schieberle, P.,
Characterization of the key aroma compounds in beef and pork vegetable gravies a la chef by application of the aroma extract dilution analysis,
J. Agric. Food Chem., 2009, 57, 19, 9114-9112, https://doi.org/10.1021/jf9023189
. [all data]
Buettner, 2007
Buettner, A.,
A selective and sensitive approach to characterize odour-active and volatile constituents in small-scale human milk samples,
Flavour Fragr. J., 2007, 22, 6, 465-473, https://doi.org/10.1002/ffj.1822
. [all data]
Lasekan, Buettner, et al., 2007
Lasekan, O.; Buettner, A.; Christlbauer, M.,
Investigation of important odorants of palm wine (Elaeis guineensis),
Food Chem., 2007, 105, 1, 15-23, https://doi.org/10.1016/j.foodchem.2006.12.052
. [all data]
Alissandrakis, Kibaris, et al., 2005
Alissandrakis, E.; Kibaris, A.C.; Tarantilis, P.A.; Harizanis, P.C.; Polissiou, M.,
Flavour compounds of Greek cotton honey,
J. Sci. Food Agric., 2005, 85, 9, 1444-1452, https://doi.org/10.1002/jsfa.2124
. [all data]
Buettner, 2004
Buettner, A.,
Investigation of potent odorants and afterodor development in two chardonnay wines using the Buccal Odor Screening System (BOSS),
J. Agric. Food Chem., 2004, 52, 8, 2339-2346, https://doi.org/10.1021/jf035322b
. [all data]
Escudero, Gogorza, et al., 2004
Escudero, A.; Gogorza, B.; Melús, M.A.; Ortín, N.; Cacho, J.; Ferreira, V.,
Characterization of the aroma of a wine from Maccabeo. Key role played by compounds with low odor activity values,
J. Agric. Food Chem., 2004, 52, 11, 3516-3524, https://doi.org/10.1021/jf035341l
. [all data]
Ferreira, Ortín, et al., 2002
Ferreira, V.; Ortín, N.; Escudero, A.; López, R.; Cacho, J.,
Chemical characterization of the aroma of grenache Rosé wines: aroma extract dilution analysis, quantitative determination, and sensory reconstitution studies,
J. Agric. Food Chem., 2002, 50, 14, 4048-4054, https://doi.org/10.1021/jf0115645
. [all data]
Aznar, López, et al., 2001
Aznar, M.; López, R.; Cacho, J.F.; Ferreira, V.,
Identification and quantification of impact odorants of aged red wines from Rioja. GC-olfactometry, quantitative GC-MS, and odor evaluation of HPLC fractions,
J. Agric. Food Chem., 2001, 49, 6, 2924-2929, https://doi.org/10.1021/jf001372u
. [all data]
Ferreira, Aznar, et al., 2001
Ferreira, V.; Aznar, M.; López, R.; Cacho, J.,
Quantitative gas chromatography-olfactometry carried out at different dilutions of an extract. Differences in the odor profiles of four high-quality spanish aged red wines,
J. Agric. Food Chem., 2001, 49, 10, 4818-4824, https://doi.org/10.1021/jf010283u
. [all data]
Lermusieau, Bulens, et al., 2001
Lermusieau, G.; Bulens, M.; Collin, S.,
Use of GC-olfactometry to identify the hop aromatic compounds in beer,
J. Agric. Food Chem., 2001, 49, 8, 3867-3874, https://doi.org/10.1021/jf0101509
. [all data]
Guyot, Scheirman, et al., 1999
Guyot, C.; Scheirman, V.; Collin, S.,
Floral origin markers of heather honeys: Calluna vulgaris and Erica arborea,
Food Chem., 1999, 64, 1, 3-11, https://doi.org/10.1016/S0308-8146(98)00122-8
. [all data]
Guyot, Bouseta, et al., 1998
Guyot, C.; Bouseta, A.; Scheirman, V.; Collin, S.,
Floral origin markers of chestnut and lime tree honeys,
J. Agric. Food Chem., 1998, 46, 2, 625-633, https://doi.org/10.1021/jf970510l
. [all data]
Schermann and Schieberle, 1997
Schermann, P.; Schieberle, P.,
Evaluation of key odorants in milk chocolate and cocoa mass by aroma extract dilution analyses,
J. Agric. Food Chem., 1997, 45, 3, 867-872, https://doi.org/10.1021/jf960670h
. [all data]
Onishi, Inoue, et al., 2011
Onishi, M.; Inoue, M.; Araki, T.; Iwabuchi, H.; Sagara, Y.,
Odorant transfer characteristics of white bread during baking,
Biosci Biotechnol. Biochem., 2011, 75, 2, 261-267, https://doi.org/10.1271/bbb.100572
. [all data]
Piyachaiseth, Jirapakkul, et al., 2011
Piyachaiseth, T.; Jirapakkul, W.; Chaiseri, S.,
Aroma compounds of flash-fried rice,
Kasetsart J. (Nat. Sci.), 2011, 45, 717-729. [all data]
Kumazawa, Sakai, et al., 2010
Kumazawa, K.; Sakai, N.; Amma, H.; Sakamoto, S.; Kodama, M.; Wada, Y.; Nishimura, O.,
Identification and formation of volatile components responsible for the characteristic aroma of Mat Rush (Igusa),
Biosci. Biotechnol. Biochem., 2010, 74, 6, 1231-1236, https://doi.org/10.1271/bbb.100053
. [all data]
Birtic, Ginies, et al., 2009
Birtic, S.; Ginies, C.; Causse, M.; Renard, C.M.G.C.; Page, D.,
Changes in volatiles and glycosides during fruit maturartion of two contrasted tomato (Solanum lycopersicum) lines,
J. Agric. Food Chem., 2009, 57, 2, 591-598, https://doi.org/10.1021/jf8023062
. [all data]
Prososki, Etzel, et al., 2007
Prososki, R.A.; Etzel, M.R.; Rankin, S.A.,
Solvent type affects the number, distribution, and relative quantities of volatile compounds found in sweet whey powder,
J. Dairy Sci., 2007, 90, 2, 523-531, https://doi.org/10.3168/jds.S0022-0302(07)71535-7
. [all data]
Xu, Fan, et al., 2007
Xu, Y.; Fan, W.; Qian, M.C.,
Characterization of Aroma Compounds in Apple Cider Using Solvent-Assisted Flavor Evaporation and Headspace Solid-Phase Microextraction,
J. Agric. Food Chem., 2007, 55, 8, 3051-3057, https://doi.org/10.1021/jf0631732
. [all data]
Fan and Qian, 2006
Fan, W.; Qian, M.C.,
Characterization of Aroma Compounds of Chinese Wuliangye and Jiannanchun Liquors by Aroma Extract Dilution Analysis,
J. Agric. Food Chem., 2006, 54, 7, 2695-2704, https://doi.org/10.1021/jf052635t
. [all data]
Ibarz, Ferreira, et al., 2006
Ibarz, M.J.; Ferreira, V.; Hernández-Orte, P.; Loscos, N.; Cacho, J.,
Optimization and evaluation of a procedure for the gas chromatographic-mass spectrometric analysis of the aromas generated by fast acid hydrolysis of flavor precursors extracted from grapes,
J. Chromatogr. A, 2006, 1116, 1-2, 217-229, https://doi.org/10.1016/j.chroma.2006.03.020
. [all data]
Culleré, Escudero, et al., 2004
Culleré, L.; Escudero, A.; Cacho, J.; Ferreira, V.,
Gas chromatography-olfactometry and chemical quantitative study of the aroma of six premium auality Spanish aged red wines,
J. Agric. Food Chem., 2004, 52, 6, 1653-1660, https://doi.org/10.1021/jf0350820
. [all data]
López, Ezpeleta, et al., 2004
López, R.; Ezpeleta, E.; Sánchez, I.; Cacho, J.; Ferreira, V.,
Analysis of the aroma intensities of volatile compounds released from mild acid hydrolysates of odourless precursors extracted from Tempranillo and Grenache grapes using gas chromatography-olfactometry,
Food Chem., 2004, 88, 1, 95-103, https://doi.org/10.1016/j.foodchem.2004.01.025
. [all data]
López, Ortín, et al., 2003
López, R.; Ortín, N.; Pérez-Trujillo, J.P.; Cacho, J.; Ferreira, V.,
Impact odorants of different young white wines from the Canary islands,
J. Agric. Food Chem., 2003, 51, 11, 3419-3425, https://doi.org/10.1021/jf026045w
. [all data]
Czerny and Schieberle, 2002
Czerny, M.; Schieberle, P.,
Important aroma compounds in freshly ground wholemeal and white wheat flour-identification and quantitative changes during sourdough fermentation,
J. Agric. Food Chem., 2002, 50, 23, 6835-6840, https://doi.org/10.1021/jf020638p
. [all data]
Bendall, 2001
Bendall, J.G.,
Aroma compounds of fresh milk from New Zealand cows fed different diets,
J. Agric. Food Chem., 2001, 49, 10, 4825-4832, https://doi.org/10.1021/jf010334n
. [all data]
Wei, Mura, et al., 2001
Wei, A.; Mura, K.; Shibamoto, T.,
Antioxidative activity of volatile chemicals extracted from beer,
J. Agric. Food Chem., 2001, 49, 8, 4097-4101, https://doi.org/10.1021/jf010325e
. [all data]
Kotseridis and Baumes, 2000
Kotseridis, Y.; Baumes, R.,
Identification of impact odorants in Bordeaux red grape juice, in the commercial yeast used for its fermentation, and in the produced wine,
J. Agric. Food Chem., 2000, 48, 2, 400-406, https://doi.org/10.1021/jf990565i
. [all data]
Iwatsuki, Mizota, et al., 1999
Iwatsuki, K.; Mizota, Y.; Kubota, T.; Nishimura, O.; Masuda, H.; Sotoyama, K.; Tomita, M.,
Aroma extract dilution analysis. Evluation of aroma of pasteurized and UHT processed milk by aroma extract dilution analysis,
Nippon Shokuhin Kagaku Kogaku Kaishi, 1999, 46, 9, 587-597, https://doi.org/10.3136/nskkk.46.587
. [all data]
Shuichi, Masazumi, et al., 1996
Shuichi, H.; Masazumi, N.; Hiromu, K.; Kiyoshi, F.,
Comparison of volatile compounds berween the crude drugs, Onji-tsutsu and Onji-niki,
Nippon nogei kagaku kaishi, 1996, 70, 2, 151-160. [all data]
Sampaio, Garruti, et al., 2011
Sampaio, K.S.; Garruti, D.S.; Franco, M.R.B.; Janzantti, N.S.; Da Silva, M.A.AP.,
Aroma volatiles recovered in the water phase of cashew apple (Anacardium occidentale L.) juice during concentration,
J. Sci. Food Agric., 2011, 91, 10, 1801-1809, https://doi.org/10.1002/jsfa.4385
. [all data]
Chinnici, Guerrero, et al., 2009
Chinnici, F.; Guerrero, E.D.; Sonni, F.; Natali, N.; Marin, R.N.; Riponi, C.,
Gas chromatography - mass spectrometry (GC-MS) characterization of volatile compounds in quality vinegars with protected Europian geographical indication,
J. Agric. Food Chem., 2009, 57, 11, 4784-4792, https://doi.org/10.1021/jf804005w
. [all data]
Frauendorfer and Schieberle, 2008
Frauendorfer, F.; Schieberle, P.,
Changes in key aroma compounds of criollo cocoa beans during roasting,
J. Agric. Food Chem., 2008, 56, 21, 10244-10251, https://doi.org/10.1021/jf802098f
. [all data]
Shu and Shen, 2008
Shu, N.; Shen, H.,
Aroma-impact compounds in Lysimachia foenum-graecum extracts,
Flavour Fragr. J., 2008, 24, 1, 1-6, https://doi.org/10.1002/ffj.1908
. [all data]
Krings, Zelena, et al., 2006
Krings, U.; Zelena, K.; Wu, S.; Berger, R.G.,
Thin-layer high-vacuum distillation to isolate volatile flavour compounds of cocoa powder,
Eur. Food Res. Technol., 2006, 223, 5, 675-681, https://doi.org/10.1007/s00217-006-0252-x
. [all data]
Tokitomo, Steihaus, et al., 2005
Tokitomo, Y.; Steihaus, M.; Buttner, A.; Schieberle, P.,
Odor-Active Constituents in Fresh Pineapple (ananas comosus [L.] Merr.) by Quamtitative and Sensory Evaluations,
Biosci. Biotechnol, Biochem,, 2005, 69, 7, 1323-1330, https://doi.org/10.1271/bbb.69.1323
. [all data]
Zehentbauer and Grosch, 1998
Zehentbauer, G.; Grosch, W.,
Crust aroma of baguettes. I. Key odorants of baguettes prepared in two different ways,
J. Cereal Science, 1998, 28, 1, 81-92, https://doi.org/10.1006/jcrs.1998.0184
. [all data]
Schieberle and Grosch, 1994
Schieberle, P.; Grosch, W.,
Potent odorants of rye bread crust - differences from the crumb and from wheat bread crust,
Z. Lebensm. Unters. Forsch., 1994, 198, 4, 292-296, https://doi.org/10.1007/BF01193177
. [all data]
Eckel, Ross, et al., 1993
Eckel, W.P.; Ross, B.; Isensee, R.K.,
Pentobarbital found in ground water,
Ground Water, 1993, 31, 5, 801-804, https://doi.org/10.1111/j.1745-6584.1993.tb00853.x
. [all data]