Copper 8-hydroxyquinolate
- Formula: C18H12CuN2O2
- Molecular weight: 351.846
- IUPAC Standard InChIKey: YXLXNENXOJSQEI-UHFFFAOYSA-L
- CAS Registry Number: 10380-28-6
- Chemical structure:
View 3d structure (requires JavaScript / HTML 5) - Other names: Copper, bis(8-quinolinolato-N1,O8)-; Copper, bis(8-quinolinolato)-; Bis(8-hydroxyquinolinato)copper; Bis(8-quinolinolato)copper; Copper bis(8-hydroxyquinolinate); Copper dioxinate; Copper hydroxyquinolate; Copper hydroxyquinolinate; Copper oxinate; Copper oxyquinolate; Copper oxyquinoline; Copper quinolate; Copper quinolinolate; Copper 8-hydroxyquinolinate; Copper 8-quinolate; Copper 8-quinolinolate; Copper(2+) oxinate; Copper-oxine; Cunilate 2174; Cupric 8-hydroxyquinolate; Cupric 8-quinolinolate; Cuproquin; Milmer 1; Oxine copper; Quinolate; Quinolate 15; Quinolate 20; Bioquin; Bioquin 1; Bis(8-quinolinato)copper; Cellu-Quin; Copper 8-quinolinolate(1:2); Copper-8; Copper, bis(8-quinolinolato-N(sup1),O(sup8))-; Cunilate; Cunilate 2419; Cuprinol Dispersion AQ; Fennotox 45; Milmer; Oxime copper; Quinondo; Timtex AQS; Timtex 17; 8-Hydroxyquinoline copper complex; 8-Quinolinol, copper (II) chelate; 8-Quinolinol, copper salt; Cunilate 2472; Dokirin; Fruitdo; Oxine cuivre; Oxyquinolinoleate de cuivre; bis(8-hydroxyquinolinato)copper(II)

Phase change data

Data compiled by: William E. Acree, Jr., James S. Chickos
Quantity | Value | Units | Method | Reference | Comment |
---|---|---|---|---|---|
ΔsubH° | 168.7 ± 7.3 | kJ/mol | ME | da Silva, Matos, et al., 1994 | |
ΔsubH° | 170. ± 3. | kJ/mol | N/A | Burkinshaw and Mortimer, 1984 |
Enthalpy of sublimation
ΔsubH (kJ/mol) | Temperature (K) | Method | Reference | Comment |
---|---|---|---|---|
160. ± 3. | 491. | ME | Burkinshaw and Mortimer, 1984 | Based on data from 478. to 503. K. |

References

da Silva, Matos, et al., 1994
da Silva, M.A.V. Ribeiro; Matos, M. Agostinha R.; Gonçalves, J.M.; Johnson, P.M.; Pilcher, G.; Burkinshaw, P.M.; Mortimer, C.T.,
Standard enthalpies of formation and sublimation of some crystalline bis(8-hydroxyquinolate) metal complexes,
Thermochimica Acta, 1994, 247, 2, 245-263, https://doi.org/10.1016/0040-6031(94)80125-8
. [all data]
Burkinshaw and Mortimer, 1984
Burkinshaw, Philip M.; Mortimer, Colin T.,
Enthalpies of sublimation of transition metal complexes,
J. Chem. Soc., Dalton Trans., 1984, 1, 75, https://doi.org/10.1039/dt9840000075
. [all data]