Benzene, isothiocyanato-
- Formula: C7H5NS
- Molecular weight: 135.186
- IUPAC Standard InChIKey: QKFJKGMPGYROCL-UHFFFAOYSA-N
- CAS Registry Number: 103-72-0
- Chemical structure:
View 3d structure (requires JavaScript / HTML 5) - Other names: Isothiocyanic acid, phenyl ester; Isothiocyanatobenzene; Phenyl isothiocyanate; Phenyl mustard oil; Phenyl thioisocyanate; Thiocarbanil; Benzene-1-isothiocyanate; Phenylsenfoel; USAF M-4; Fenylisothiokyanat; PITC; NSC 5583

Condensed phase thermochemistry data

Data compiled as indicated in comments:
ALS - Hussein Y. Afeefy, Joel F. Liebman, and Stephen E. Stein
DH - Eugene S. Domalski and Elizabeth D. Hearing
Quantity | Value | Units | Method | Reference | Comment |
---|---|---|---|---|---|
ΔfH°liquid | 212. | kJ/mol | Ccb | Berthelot, 1901 | H2SO4.1.5H2O; ALS |
Quantity | Value | Units | Method | Reference | Comment |
ΔcH°liquid | -4289.0 | kJ/mol | Ccb | Berthelot, 1901, 2 | ALS |
ΔcH°liquid | -4286.1 | kJ/mol | Ccb | Berthelot, 1901 | H2SO4.1.5H2O; ALS |
Constant pressure heat capacity of liquid
Cp,liquid (J/mol*K) | Temperature (K) | Reference | Comment |
---|---|---|---|
186.2 | 290. | Kurnakov and Voskresenskaya, 1936 | DH |

Phase change data

Data compiled as indicated in comments:
TRC - Thermodynamics Research Center, NIST Boulder Laboratories, Chris Muzny director
AC - William E. Acree, Jr., James S. Chickos
Quantity | Value | Units | Method | Reference | Comment |
---|---|---|---|---|---|
Tboil | 494.15 | K | N/A | Perkin, 1896 | Uncertainty assigned by TRC = 1. K; TRC |
Tboil | 491.65 | K | N/A | Kahlbaum, 1884 | Uncertainty assigned by TRC = 2. K; TRC |
Enthalpy of vaporization
ΔvapH (kJ/mol) | Temperature (K) | Method | Reference | Comment |
---|---|---|---|---|
52.6 | 335. | A | Stephenson and Malanowski, 1987 | Based on data from 320. to 492. K. See also Stull, 1947.; AC |
Antoine Equation Parameters
log10(P) = A − (B / (T + C))
P = vapor pressure (bar)
T = temperature (K)
View plot Requires a JavaScript / HTML 5 canvas capable browser.
Temperature (K) | A | B | C | Reference | Comment |
---|---|---|---|---|---|
320.4 to 491.7 | 4.4421 | 1930.513 | -58.467 | Stull, 1947 | Coefficents calculated by NIST from author's data. |

Gas phase ion energetics data

Data compiled as indicated in comments:
LLK - Sharon G. Lias, Rhoda D. Levin, and Sherif A. Kafafi
RDSH - Henry M. Rosenstock, Keith Draxl, Bruce W. Steiner, and John T. Herron
Ionization energy determinations
IE (eV) | Method | Reference | Comment |
---|---|---|---|
8.520 ± 0.005 | PI | Watanabe, Nakayama, et al., 1962 | RDSH |
8.53 | PE | Kobayashi and Nagakura, 1975 | Vertical value; LLK |

Normal alkane RI, non-polar column, custom temperature program

Column type | Active phase | I | Reference | Comment |
---|---|---|---|---|
Capillary | Polydimethyl siloxanes | 1163. | Zenkevich, 2001 | Program: not specified |

References

Berthelot, 1901
Berthelot, M.,
Chimie Organique. - Nouvelles recherches sur l'isomerie des ethers sulfocyaniques,
Compt. Rend., 1901, 132, 57-58. [all data]
Berthelot, 1901, 2
Berthelot, M.,
Recherches sur la formation des composes organiques sulfures,
Ann. Chim. Phys., 1901, 22, 323-326. [all data]
Kurnakov and Voskresenskaya, 1936
Kurnakov, N.S.; Voskresenskaya, N.K.,
Calorimetry of liquid binary systems, Izv. Akad. Nauk SSSR,
Otdel. Mat. i Estestv. Nauk. Ser. Khim, 1936, 1936, 439-461. [all data]
Perkin, 1896
Perkin, W.H.,
LXIX. On Magnetic Rotatory Power, especially of Aromatic Compounds,
J. Chem. Soc., 1896, 69, 1025-1257. [all data]
Kahlbaum, 1884
Kahlbaum, G.W.A.,
The dependence of Boiling Temperature on Air Pressure,
Ber. Dtsch. Chem. Ges., 1884, 17, 1245. [all data]
Stephenson and Malanowski, 1987
Stephenson, Richard M.; Malanowski, Stanislaw,
Handbook of the Thermodynamics of Organic Compounds, 1987, https://doi.org/10.1007/978-94-009-3173-2
. [all data]
Stull, 1947
Stull, Daniel R.,
Vapor Pressure of Pure Substances. Organic and Inorganic Compounds,
Ind. Eng. Chem., 1947, 39, 4, 517-540, https://doi.org/10.1021/ie50448a022
. [all data]
Watanabe, Nakayama, et al., 1962
Watanabe, K.; Nakayama, T.; Mottl, J.,
Ionization potentials of some molecules,
J. Quant. Spectry. Radiative Transfer, 1962, 2, 369. [all data]
Kobayashi and Nagakura, 1975
Kobayashi, T.; Nagakura, S.,
Photoelectron spectra of phenyl isocyanates and phenyl isothio- cyanate,
J. Electron Spectrosc. Relat. Phenom., 1975, 7, 488. [all data]
Lang (editor), 1965
Lang (editor), L.,
Absorption Spectra in the Ultraviolet and Visible Region, 1965, 6, 7. [all data]