Benzenemethanamine, N-methyl-
- Formula: C8H11N
- Molecular weight: 121.1796
- IUPAC Standard InChIKey: RIWRFSMVIUAEBX-UHFFFAOYSA-N
- CAS Registry Number: 103-67-3
- Chemical structure:
View 3d structure (requires JavaScript / HTML 5) - Other names: Benzylamine, N-methyl-; Benzylmethylamine; Methylbenzylamine; N-Benzyl-N-methylamine; N-Benzylmethylamine; N-Methylbenzylamine; N-Methy-N-benzylamine; N-Methyl(phenyl)methanamine; N-Methyl-N-(phenylmethyl)amine; NSC 8059; Benzeneamine, N-methyl

Phase change data

Data compiled by: Robert L. Brown and Stephen E. Stein
Quantity | Value | Units | Method | Reference | Comment |
---|---|---|---|---|---|
Tboil | 459.7 | K | N/A | Aldrich Chemical Company Inc., 1990 | |
Tboil | 453.7 | K | N/A | Weast and Grasselli, 1989 |
Reduced pressure boiling point
Tboil (K) | Pressure (bar) | Reference |
---|---|---|
351.2 | 0.019 | Weast and Grasselli, 1989 |

Gas phase ion energetics data

Data compiled as indicated in comments:
LLK - Sharon G. Lias, Rhoda D. Levin, and Sherif A. Kafafi
RDSH - Henry M. Rosenstock, Keith Draxl, Bruce W. Steiner, and John T. Herron
Ionization energy determinations
IE (eV) | Method | Reference | Comment |
---|---|---|---|
8.65 | EI | Loudon, Maccoll, et al., 1970 | RDSH |
8.73 | PE | Fragala, Millefiori, et al., 1980 | Vertical value; LLK |
Appearance energy determinations
Ion | AE (eV) | Other Products | Method | Reference | Comment |
---|---|---|---|---|---|
C7H7+ | 12.61 | ? | EI | Loudon, Maccoll, et al., 1970 | RDSH |

Van Den Dool and Kratz RI, non-polar column, temperature ramp

Column type | Active phase | I | Reference | Comment |
---|---|---|---|---|
Capillary | DB-1 | 1026.0 | Sun and Stremple, 2003 | 30. m/0.25 mm/0.25 μm, He, 3. K/min; Tstart: 40. C; Tend: 325. C |

Normal alkane RI, non-polar column, custom temperature program

Column type | Active phase | I | Reference | Comment |
---|---|---|---|---|
Other | Methyl Silicone | 1078. | Ardrey and Moffat, 1981 | Program: not specified |

References

Aldrich Chemical Company Inc., 1990
Aldrich Chemical Company Inc.,
Catalog Handbook of Fine Chemicals, Aldrich Chemical Company, Inc., Milwaukee WI, 1990, 1. [all data]
Weast and Grasselli, 1989
CRC Handbook of Data on Organic Compounds, 2nd Editon, Weast,R.C and Grasselli, J.G., ed(s)., CRC Press, Inc., Boca Raton, FL, 1989, 1. [all data]
Loudon, Maccoll, et al., 1970
Loudon, A.G.; Maccoll, A.; Wong, S.K.,
Comparison between unimolecular gas phase pyrolysis and electron impact fragmentation. Part I. The mass spectra of tetralin and some related heterocycles,
J. Chem. Soc. B, 1970, 1727. [all data]
Fragala, Millefiori, et al., 1980
Fragala, I.; Millefiori, S.; Recca, A.,
Gas phase ultraviolet photoelectron spectra of aromatic azomethine compounds,
J. Chem. Res. Synop., 1980, 1, 28. [all data]
Sun and Stremple, 2003
Sun, G.; Stremple, P.,
Retention index characterization of flavor, fragrance, and many other compounds on DB-1 and DB-XLB, 2003, retrieved from http://www.chem.agilent.com/cag/cabu/pdf/b-0279.pdf. [all data]
Ardrey and Moffat, 1981
Ardrey, R.E.; Moffat, A.C.,
Gas-liquid chromatographic retention indices of 1318 substances of toxicological interest on SE-30 or OV-1 stationary phase,
J. Chromatogr., 1981, 220, 3, 195-252, https://doi.org/10.1016/S0021-9673(00)81925-1
. [all data]