Benzene, propyl-
- Formula: C9H12
- Molecular weight: 120.1916
- IUPAC Standard InChIKey: ODLMAHJVESYWTB-UHFFFAOYSA-N
- CAS Registry Number: 103-65-1
- Chemical structure:
View 3d structure (requires JavaScript / HTML 5) - Other names: n-Propylbenzene; Isocumene; Propylbenzene; 1-Phenylpropane; 1-Propylbenzene; Phenylpropane; UN 2364; Benzene, n-propyl-; NSC 16941

Gas phase thermochemistry data

Data compiled as indicated in comments:
ALS - Hussein Y. Afeefy, Joel F. Liebman, and Stephen E. Stein
GT - Glushko Thermocenter, Russian Academy of Sciences, Moscow
Quantity | Value | Units | Method | Reference | Comment |
---|---|---|---|---|---|
ΔfH°gas | 7.82 ± 0.84 | kJ/mol | Ccb | Prosen, Gilmont, et al., 1945 | Hf by Prosen, Johnson, et al., 1946; ALS |
Quantity | Value | Units | Method | Reference | Comment |
S°gas | 397.86 | J/mol*K | N/A | Messerly J.F., 1965 | S(298.15 K) estimated by the method of increments [ Thermodynamics Research Center, 1997, Taylor W.J., 1946] is about 2.5 J/mol*K larger than experimental one.; GT |

Reaction thermochemistry data

Data compiled as indicated in comments:
M - Michael M. Meot-Ner (Mautner) and Sharon G. Lias
B - John E. Bartmess
ALS - Hussein Y. Afeefy, Joel F. Liebman, and Stephen E. Stein
Individual Reactions
By formula: NO- + C9H12 = (NO- • C9H12)
Quantity | Value | Units | Method | Reference | Comment |
---|---|---|---|---|---|
ΔrH° | 189. | kJ/mol | ICR | Reents and Freiser, 1981 | gas phase; switching reaction,Thermochemical ladder(NO+)C2H5OH, Entropy change calculated or estimated; Farid and McMahon, 1978; M |
By formula: Cl- + C9H12 = (Cl- • C9H12)
Quantity | Value | Units | Method | Reference | Comment |
---|---|---|---|---|---|
ΔrG° | 20.9 | kJ/mol | TDEq | French, Ikuta, et al., 1982 | gas phase; B |
Free energy of reaction
ΔrG° (kJ/mol) | T (K) | Method | Reference | Comment |
---|---|---|---|---|
23. | 300. | PHPMS | French, Ikuta, et al., 1982 | gas phase; M |
By formula: H2 + C9H10 = C9H12
Quantity | Value | Units | Method | Reference | Comment |
---|---|---|---|---|---|
ΔrH° | -105.9 ± 1.3 | kJ/mol | Chyd | Abboud, Jimenez, et al., 1995 | liquid phase; solvent: Hyrocarbon; Like gas phase; ALS |
By formula: H2 + C9H10 = C9H12
Quantity | Value | Units | Method | Reference | Comment |
---|---|---|---|---|---|
ΔrH° | -126. ± 0.8 | kJ/mol | Chyd | Rogers and McLafferty, 1971 | liquid phase; solvent: Hydrocarbon; ALS |
By formula: 2H2 + C9H8 = C9H12
Quantity | Value | Units | Method | Reference | Comment |
---|---|---|---|---|---|
ΔrH° | -260.2 ± 2.0 | kJ/mol | Chyd | Davis, Allinger, et al., 1985 | liquid phase; solvent: Hexane; ALS |
By formula: C9H12 + 3H2 = C9H18
Quantity | Value | Units | Method | Reference | Comment |
---|---|---|---|---|---|
ΔrH° | -210. | kJ/mol | Eqk | Miki, 1975 | gas phase; GC; ALS |

Gas phase ion energetics data

Data evaluated as indicated in comments:
HL - Edward P. Hunter and Sharon G. Lias
L - Sharon G. Lias
Data compiled as indicated in comments:
LL - Sharon G. Lias and Joel F. Liebman
LBLHLM - Sharon G. Lias, John E. Bartmess, Joel F. Liebman, John L. Holmes, Rhoda D. Levin, and W. Gary Mallard
LLK - Sharon G. Lias, Rhoda D. Levin, and Sherif A. Kafafi
RDSH - Henry M. Rosenstock, Keith Draxl, Bruce W. Steiner, and John T. Herron
Quantity | Value | Units | Method | Reference | Comment |
---|---|---|---|---|---|
IE (evaluated) | 8.713 ± 0.010 | eV | N/A | N/A | L |
Quantity | Value | Units | Method | Reference | Comment |
Proton affinity (review) | 790.1 | kJ/mol | N/A | Hunter and Lias, 1998 | HL |
Quantity | Value | Units | Method | Reference | Comment |
Gas basicity | 762.4 | kJ/mol | N/A | Hunter and Lias, 1998 | HL |
Ionization energy determinations
IE (eV) | Method | Reference | Comment |
---|---|---|---|
8.7134 | TE | Takahashi and Kimura, 1992 | LL |
8.77 ± 0.08 | EI | Selim and Helal, 1982 | LBLHLM |
8.71 | EI | McLoughlin, Morrison, et al., 1979 | LLK |
8.723 ± 0.008 | EQ | Lias and Ausloos, 1978 | LLK |
8.72 ± 0.01 | PI | Watanabe, 1957 | RDSH |
Appearance energy determinations
Ion | AE (eV) | Other Products | Method | Reference | Comment |
---|---|---|---|---|---|
C5H5+ | 15.5 ± 0.2 | C2H5+C2H2 | EI | Tajima and Tsuchiya, 1973 | LLK |
C7H7+ | 10.57 ± 0.10 | C2H5 | EI | Selim and Helal, 1982 | LBLHLM |
C7H7+ | 9.85 | C2H5 | EI | McLoughlin, Morrison, et al., 1979 | LLK |
C7H7+ | 11.64 | ? | EI | Loudon, Maccoll, et al., 1970 | RDSH |
C8H9+ | 9.98 | CH3 | EI | McLoughlin, Morrison, et al., 1979 | LLK |

Ion clustering data

Data compiled as indicated in comments:
B - John E. Bartmess
M - Michael M. Meot-Ner (Mautner) and Sharon G. Lias
Clustering reactions
By formula: Cl- + C9H12 = (Cl- • C9H12)
Quantity | Value | Units | Method | Reference | Comment |
---|---|---|---|---|---|
ΔrG° | 20.9 | kJ/mol | TDEq | French, Ikuta, et al., 1982 | gas phase; B |
Free energy of reaction
ΔrG° (kJ/mol) | T (K) | Method | Reference | Comment |
---|---|---|---|---|
23. | 300. | PHPMS | French, Ikuta, et al., 1982 | gas phase; M |
By formula: NO- + C9H12 = (NO- • C9H12)
Quantity | Value | Units | Method | Reference | Comment |
---|---|---|---|---|---|
ΔrH° | 189. | kJ/mol | ICR | Reents and Freiser, 1981 | gas phase; switching reaction,Thermochemical ladder(NO+)C2H5OH, Entropy change calculated or estimated; Farid and McMahon, 1978; M |

Condensed phase thermochemistry data

Data compiled as indicated in comments:
ALS - Hussein Y. Afeefy, Joel F. Liebman, and Stephen E. Stein
DH - Eugene S. Domalski and Elizabeth D. Hearing
Quantity | Value | Units | Method | Reference | Comment |
---|---|---|---|---|---|
ΔfH°liquid | -9.18 ± 0.20 | kcal/mol | Ccb | Prosen, Gilmont, et al., 1945 | Hf by Prosen, Johnson, et al., 1946; ALS |
Quantity | Value | Units | Method | Reference | Comment |
ΔcH°liquid | -1247.19 ± 0.16 | kcal/mol | Ccb | Prosen, Gilmont, et al., 1945 | Hf by Prosen, Johnson, et al., 1946; Corresponding ΔfHºliquid = -9.16 kcal/mol (simple calculation by NIST; no Washburn corrections); ALS |
ΔcH°liquid | -1246.4 | kcal/mol | Ccb | Richards and Barry, 1915 | At 291 K; Corresponding ΔfHºliquid = -9.99 kcal/mol (simple calculation by NIST; no Washburn corrections); ALS |
Quantity | Value | Units | Method | Reference | Comment |
S°liquid | 68.781 | cal/mol*K | N/A | Messerly, Todd, et al., 1965 | DH |
Constant pressure heat capacity of liquid
Cp,liquid (cal/mol*K) | Temperature (K) | Reference | Comment |
---|---|---|---|
51.319 | 298.15 | Messerly, Todd, et al., 1965 | T = 10 to 370 K.; DH |
44.0 | 295. | Tschamler, 1948 | DH |

Phase change data

Data compiled as indicated in comments:
BS - Robert L. Brown and Stephen E. Stein
TRC - Thermodynamics Research Center, NIST Boulder Laboratories, Chris Muzny director
AC - William E. Acree, Jr., James S. Chickos
ALS - Hussein Y. Afeefy, Joel F. Liebman, and Stephen E. Stein
DRB - Donald R. Burgess, Jr.
DH - Eugene S. Domalski and Elizabeth D. Hearing
Quantity | Value | Units | Method | Reference | Comment |
---|---|---|---|---|---|
Tboil | 432. ± 2. | K | AVG | N/A | Average of 41 out of 46 values; Individual data points |
Quantity | Value | Units | Method | Reference | Comment |
Tfus | 173. ± 2. | K | AVG | N/A | Average of 16 values; Individual data points |
Quantity | Value | Units | Method | Reference | Comment |
Ttriple | 173.59 | K | N/A | Messerly, Todd, et al., 1965, 2 | Crystal phase 1 phase; Uncertainty assigned by TRC = 0.01 K; TRC |
Ttriple | 171.6 | K | N/A | Messerly, Todd, et al., 1965, 2 | Metastable crystal phase; Uncertainty assigned by TRC = 0.01 K; TRC |
Quantity | Value | Units | Method | Reference | Comment |
Tc | 638.4 ± 0.1 | K | N/A | Tsonopoulos and Ambrose, 1995 | |
Tc | 638.24 | K | N/A | Ambrose, Broderick, et al., 1967 | Uncertainty assigned by TRC = 0.1 K; TRC |
Tc | 638.36 | K | N/A | Ambrose, Cox, et al., 1960 | Uncertainty assigned by TRC = 0.3 K; Visual, PRT, IPTS-48; TRC |
Tc | 639.2 | K | N/A | Simon, 1957 | Uncertainty assigned by TRC = 0.4 K; TRC |
Tc | 638.8 | K | N/A | Altschul, 1893 | Uncertainty assigned by TRC = 0.6 K; TRC |
Quantity | Value | Units | Method | Reference | Comment |
Pc | 31.58 ± 0.099 | atm | N/A | Tsonopoulos and Ambrose, 1995 | |
Pc | 31.58 | atm | N/A | Ambrose, Broderick, et al., 1967 | Uncertainty assigned by TRC = 0.06 atm; TRC |
Pc | 31.29 | atm | N/A | Altschul, 1893 | Uncertainty assigned by TRC = 0.048 atm; TRC |
Quantity | Value | Units | Method | Reference | Comment |
Vc | 0.440 | l/mol | N/A | Tsonopoulos and Ambrose, 1995 | |
Quantity | Value | Units | Method | Reference | Comment |
ρc | 2.27 ± 0.010 | mol/l | N/A | Tsonopoulos and Ambrose, 1995 | |
ρc | 2.269 | mol/l | N/A | Simon, 1957 | Uncertainty assigned by TRC = 0.03 mol/l; TRC |
Quantity | Value | Units | Method | Reference | Comment |
ΔvapH° | 11.0 ± 0.2 | kcal/mol | AVG | N/A | Average of 8 values; Individual data points |
Enthalpy of vaporization
ΔvapH (kcal/mol) | Temperature (K) | Method | Reference | Comment |
---|---|---|---|---|
10.2 | 363. | A,MM | Stephenson and Malanowski, 1987 | Based on data from 348. to 433. K. See also Forziati, Norris, et al., 1949 and Willingham, Taylor, et al., 1945.; AC |
10.5 | 355. | N/A | Paul, Krug, et al., 1986 | Based on data from 340. to 391. K.; AC |
Antoine Equation Parameters
log10(P) = A − (B / (T + C))
P = vapor pressure (atm)
T = temperature (K)
View plot Requires a JavaScript / HTML 5 canvas capable browser.
Temperature (K) | A | B | C | Reference |
---|---|---|---|---|
348.97 to 433.39 | 4.07013 | 1490.963 | -66.0 | Forziati, Norris, et al., 1949, 2 |
Enthalpy of fusion
ΔfusH (kcal/mol) | Temperature (K) | Reference | Comment |
---|---|---|---|
2.22 | 173.6 | Acree, 1991 | AC |
Enthalpy of phase transition
ΔHtrs (kcal/mol) | Temperature (K) | Initial Phase | Final Phase | Reference | Comment |
---|---|---|---|---|---|
2.031 | 171.67 | crystaline, II | liquid | Messerly, Todd, et al., 1965 | DH |
2.215 | 173.60 | crystaline, I | liquid | Messerly, Todd, et al., 1965 | Metastable crystals.; DH |
Entropy of phase transition
ΔStrs (cal/mol*K) | Temperature (K) | Initial Phase | Final Phase | Reference | Comment |
---|---|---|---|---|---|
11.83 | 171.67 | crystaline, II | liquid | Messerly, Todd, et al., 1965 | DH |
12.76 | 173.60 | crystaline, I | liquid | Messerly, Todd, et al., 1965 | Metastable; DH |

Henry's Law data

Data compiled by: Rolf Sander
Henry's Law constant (water solution)
kH(T) = k°H exp(d(ln(kH))/d(1/T) ((1/T) - 1/(298.15 K)))
k°H = Henry's law constant for solubility in water at 298.15 K (mol/(kg*bar))
d(ln(kH))/d(1/T) = Temperature dependence constant (K)
k°H (mol/(kg*bar)) | d(ln(kH))/d(1/T) (K) | Method | Reference | Comment |
---|---|---|---|---|
0.097 | Q | N/A | missing citation give several references for the Henry's law constants but don't assign them to specific species. | |
0.090 | 3700. | X | N/A | |
0.14 | L | N/A | ||
0.10 | V | N/A |

Normal alkane RI, non-polar column, temperature ramp

Data compiled by: NIST Mass Spectrometry Data Center, William E. Wallace, director

Column type CapillaryCapillaryCapillaryCapillaryCapillary
Active phase Polydimethyl siloxane: CP-Sil 5 CBHP-5 MSPetrocol DHVF-5 MSVF-5 MS
Column length (m) 60.30.100.60.60.
Carrier gas HeliumHeliumHeliumHeliumHelium
Substrate
Column diameter (mm) 0.250.250.250.320.32
Phase thickness (μm) 1.00.250.500.250.25
Tstart (C) 45.35.20.30.30.
Tend (C) 210.300.220.260.260.
Heat rate (K/min) 3.63.15.2.2.
Initial hold (min) 1.455.15.
Final hold (min) 2.7215.30.28.28.
I 947.950.943.953.957.
ReferenceBramston-Cook, 2013Kotowska, Zalikowski, et al., 2012Supelco, 2012Leffingwell and Alford, 2011Leffingwell and Alford, 2011
Comment MSDC-RI MSDC-RI MSDC-RI MSDC-RI MSDC-RI
Column type CapillaryCapillaryCapillaryCapillaryCapillary
Active phase PONAHP-5SPB-5SPB-55 % Phenyl methyl siloxane
Column length (m) 50.60.30.60.15.
Carrier gas NitrogenHeHeHelium
Substrate
Column diameter (mm) 0.200.320.250.320.25
Phase thickness (μm) 0.500.250.251.00.25
Tstart (C) 35.30.60.30.40.
Tend (C) 200.260.250.230.250.
Heat rate (K/min) 2.2.4.3.5.
Initial hold (min) 15.2.2.
Final hold (min) 10.28.20. 2.
I 946.957.9957.962.950.
ReferenceZhang, Ding, et al., 2009Leffingwell and Alford, 2005Pino, Marbot, et al., 2005Sebastian, Viallon-Fernandez, et al., 2003Hussam, Alauddin, et al., 2002
Comment MSDC-RI MSDC-RI MSDC-RI MSDC-RI MSDC-RI
Column type CapillaryCapillaryCapillaryCapillaryCapillary
Active phase HP-5BP-1DB-5MSOV-1OV-101
Column length (m) 30.50.30. 50.
Carrier gas  HeHe Helium
Substrate
Column diameter (mm) 0.250.220.25 0.20
Phase thickness (μm)  0.750.25 0.50
Tstart (C) 50.50.40.50.30.
Tend (C) 200.200.250.160.100.
Heat rate (K/min) 3.5.3.2.1.
Initial hold (min)   1. 6.
Final hold (min)
I 954.949.943.943.939.
ReferenceIsidorov and Jdanova, 2002Health Safety Executive, 2000Shoenmakers, Oomen, et al., 2000Orav, Kailas, et al., 1999Orav, Kailas, et al., 1999, 2
Comment MSDC-RI MSDC-RI MSDC-RI MSDC-RI MSDC-RI
Column type CapillaryCapillaryCapillaryCapillaryCapillary
Active phase HP-5DB-1CP Sil 5 CBDB-5DB-5
Column length (m) 30.60.25.60.60.
Carrier gas HeHeHeHeHe
Substrate
Column diameter (mm) 0.250.320.320.250.25
Phase thickness (μm) 0.251.20.45
Tstart (C) 35.30.0.40.40.
Tend (C) 300.240.320.160.160.
Heat rate (K/min) 10.3.3.2.2.
Initial hold (min) 2.10.5.5.5.
Final hold (min) 10. 10.
I 960.7946.936.966.964.
ReferenceWang and Fingas, 1995Ciccioli, Cecinato, et al., 1992Hartgers, Damste, et al., 1992Macku and Shibamoto, 1991Macku and Shibamoto, 1991, 2
Comment MSDC-RI MSDC-RI MSDC-RI MSDC-RI MSDC-RI
Column type CapillaryCapillaryPackedCapillary
Active phase DB-1SE-30Apiezon LSF-96
Column length (m) 60.50.2.111.
Carrier gas  He Nitrogen
Substrate   Chromosorb G-AW-DMCS
Column diameter (mm) 0.320.5 0.76
Phase thickness (μm)
Tstart (C) 50.40.25.
Tend (C) 250.170. 130.
Heat rate (K/min) 4.3.10.3.
Initial hold (min) 0.13. 8.
Final hold (min) 5.  40.
I 937.940.940.945.
ReferenceFlath, Mon, et al., 1983Heydanek and McGorrin, 1981Dahlmann, Köser, et al., 1979Donetzhuber, Johansson, et al., 1976
Comment MSDC-RI MSDC-RI MSDC-RI MSDC-RI

Kovats' RI, non-polar column, temperature ramp

Data compiled by: NIST Mass Spectrometry Data Center, William E. Wallace, director

Column type CapillaryCapillaryCapillaryCapillaryCapillary
Active phase DB-5DB-1DB-1DB-5SE-54
Column length (m) 60.60.60.30.30.
Carrier gas He  HeHe
Substrate
Column diameter (mm) 0.320.250.250.320.25
Phase thickness (μm) 1.0.250.250.250.25
Tstart (C) 40.30.30.50.0.
Tend (C) 230.220.220.300.250.
Heat rate (K/min) 3.2.2.6.12.
Initial hold (min) 5.4.4.2.12.
Final hold (min) 2.
I 962.938.940.955.3946.
ReferenceBuchin, Salmon, et al., 2002Takeoka, Perrino, et al., 1996Takeoka, Perrino, et al., 1996Wang, Fingas, et al., 1994Rembold, Wallner, et al., 1989
Comment MSDC-RI MSDC-RI MSDC-RI MSDC-RI MSDC-RI
Column type CapillaryCapillaryCapillaryCapillaryCapillary
Active phase OV-101OV-101SE-30SE-30Apiezon L
Column length (m) 50.110.50.50.50.
Carrier gas  HeHeHeN2
Substrate
Column diameter (mm) 0.230.250.50.50.25
Phase thickness (μm)  0.20
Tstart (C) 80.35.40.40.60.
Tend (C) 200.200.170.170.
Heat rate (K/min) 2.1.3.3.1.
Initial hold (min)   3.3.
Final hold (min)
I 929.937.944.945.959.
ReferenceOhnishi and Shibamoto, 1984Hayes and Pitzer, 1982Greenberg, 1981Greenberg, 1981Louis, 1971
Comment MSDC-RI MSDC-RI MSDC-RI MSDC-RI MSDC-RI

Kovats' RI, non-polar column, custom temperature program

Data compiled by: NIST Mass Spectrometry Data Center, William E. Wallace, director

Column type CapillaryCapillaryCapillary
Active phase Petrocol DH-100DB-1Squalane
Column length (m) 100.60.100.
Carrier gas HeHeN2
Substrate
Column diameter (mm) 0.20.320.25
Phase thickness (μm)  1.0
Program 5C(10min) => 5C/min => 50C(48min) => 1.5C/min => 195C(91min)-40 C for 12 min; -40 - 125 C at 3 deg.min; 125-185 C at 6 deg/min; 185 - 220 C at 20 deg/min; hold 220 C for 2 minnot specified
I 946.15943.939.
ReferenceHaagen-Smit Laboratory, 1997Hoekman, 1993Papazova and Pankova, 1975
Comment MSDC-RI MSDC-RI MSDC-RI

Van Den Dool and Kratz RI, polar column, custom temperature program

Data compiled by: NIST Mass Spectrometry Data Center, William E. Wallace, director

Column type CapillaryCapillary
Active phase Supelcowax-10Supelcowax-10
Column length (m) 30.30.
Carrier gas  He
Substrate
Column diameter (mm) 0.250.25
Phase thickness (μm) 0.250.25
Program 35C(8min) => 4C/min => 60C => 6C/min => 160C => 20C/min => 220C(1min)35C(8min) => 4C/min => 60C => 6C/min => 160C => 20C/min => 200C(1min)
I 1200.1207.
ReferenceBianchi, Cantoni, et al., 2007Bianchi, Careri, et al., 2007
Comment MSDC-RI MSDC-RI

Normal alkane RI, non-polar column, isothermal

Data compiled by: NIST Mass Spectrometry Data Center, William E. Wallace, director

Column type CapillaryCapillaryCapillaryCapillaryCapillary
Active phase Polydimethyl siloxanePolydimethyl siloxanePolydimethyl siloxaneMethyl SiliconeMethyl Silicone
Column length (m)
Carrier gas
Substrate
Column diameter (mm)
Phase thickness (μm)
Temperature (C) 105.75.90.100.120.
I 950.942.946.949.955.
ReferenceTello, Lebron-Aguilar, et al., 2009Tello, Lebron-Aguilar, et al., 2009Tello, Lebron-Aguilar, et al., 2009Lebrón-Aguilar, Quintanilla-López, et al., 2007Lebrón-Aguilar, Quintanilla-López, et al., 2007
Comment MSDC-RI MSDC-RI MSDC-RI MSDC-RI MSDC-RI
Column type CapillaryCapillaryCapillaryCapillaryCapillary
Active phase Methyl SiliconeMethyl SiliconeMethyl SiliconeOV-101OV-101
Column length (m)    50.50.
Carrier gas    NitrogenNitrogen
Substrate
Column diameter (mm)    0.300.30
Phase thickness (μm)    0.260.26
Temperature (C) 140.80.120.100.100.
I 960.943.978.947.949.
ReferenceLebrón-Aguilar, Quintanilla-López, et al., 2007Lebrón-Aguilar, Quintanilla-López, et al., 2007Chen and Feng, 2006Gerasimenko and Nabivach, 1995Gerasimenko and Nabivach, 1995
Comment MSDC-RI MSDC-RI MSDC-RI MSDC-RI MSDC-RI
Column type CapillaryCapillaryCapillaryCapillaryCapillary
Active phase OV-101OV-101OV-101OV-101OV-101
Column length (m) 50.50.50.50.50.
Carrier gas NitrogenNitrogenNitrogen
Substrate
Column diameter (mm) 0.300.300.300.200.20
Phase thickness (μm) 0.260.260.26
Temperature (C) 100.100.100.100.100.
I 949.949.950.948.949.
ReferenceGerasimenko and Nabivach, 1995Gerasimenko and Nabivach, 1995Gerasimenko and Nabivach, 1995Tian, 1993Tian, 1993
Comment MSDC-RI MSDC-RI MSDC-RI MSDC-RI MSDC-RI
Column type CapillaryCapillaryCapillaryCapillaryCapillary
Active phase OV-101OV-101OV-101OV-101Squalane
Column length (m) 50.50.20.20.
Carrier gas     H2
Substrate
Column diameter (mm) 0.200.200.230.23
Phase thickness (μm)
Temperature (C) 120.120.32.80.95.4
I 954.955.933.947.926.
ReferenceTian, 1993Tian, 1993Blazso, Ujszaszi, et al., 1980Blazso, Ujszaszi, et al., 1980Sojak and Vigdergauz, 1978
Comment MSDC-RI MSDC-RI MSDC-RI MSDC-RI MSDC-RI
Column type CapillaryPacked
Active phase SqualanePolydimethyl siloxane
Column length (m) 100.
Carrier gas N2
Substrate
Column diameter (mm) 0.25
Phase thickness (μm)
Temperature (C) 110.110.
I 939.952.
ReferencePapazova and Pankova, 1975Ferrand, 1962
Comment MSDC-RI MSDC-RI

References

Prosen, Gilmont, et al., 1945
Prosen, E.J.; Gilmont, R.; Rossini, F.D.,
Heats of combustion of benzene, toluene, ethyl-benzene, o-xylene, m-xylene, p-xylene, n-propylbenzene, and styrene,
J. Res. NBS, 1945, 34, 65-70. [all data]
Prosen, Johnson, et al., 1946
Prosen, E.J.; Johnson, W.H.; Rossini, F.D.,
Heats of combustion and formation at 25°C of the alkylbenzenes through C10H14, and of the higher normal monoalkylbenzenes,
J. Res. NBS, 1946, 36, 455-461. [all data]
Messerly J.F., 1965
Messerly J.F.,
Low-temperature thermodynamic properties of n-propyl- and n-butyl-benzene,
J. Phys. Chem., 1965, 69, 4304-4310. [all data]
Thermodynamics Research Center, 1997
Thermodynamics Research Center,
Selected Values of Properties of Chemical Compounds., Thermodynamics Research Center, Texas A&M University, College Station, Texas, 1997. [all data]
Taylor W.J., 1946
Taylor W.J.,
Heats, equilibrium constants, and free energies of formation of the alkylbenzenes,
J. Res. Nat. Bur. Stand., 1946, 37, 95-122. [all data]
Reents and Freiser, 1981
Reents, W.D.; Freiser, B.S.,
Gas-Phase Binding Energies and Spectroscopic Properties of NO+ Charge-Transfer Complexes,
J. Am. Chem. Soc., 1981, 103, 2791. [all data]
Farid and McMahon, 1978
Farid, R.; McMahon, T.B.,
Gas-Phase Ion-Molecule Reactions of Alkyl Nitrites by Ion Cyclotron Resonance Spectroscopy,
Int. J. Mass Spectrom. Ion Phys., 1978, 27, 2, 163, https://doi.org/10.1016/0020-7381(78)80037-0
. [all data]
French, Ikuta, et al., 1982
French, M.A.; Ikuta, S.; Kebarle, P.,
Hydrogen bonding of O-H and C-H hydrogen donors to Cl-. Results from mass spectrometric measurement of the ion-molecule equilibria RH + Cl- = RHCl-,
Can. J. Chem., 1982, 60, 1907. [all data]
Abboud, Jimenez, et al., 1995
Abboud, J.-L.M.; Jimenez, P.; Roux, M.V.; Turrion, C.; Lopez-Mardomingo, C.; Podosenin, A.; Rogers, D.W.; Liebman, J.F.,
Interrelations of the energetics of amides and alkenes: enthalpies of formation of N,N-dimethyl dertivatives of pivalamide, 1-adamantylcarboxamide and benzamide, and of styrene and its a-, trans-β- and β,β-methylated derivates,
J. Phys. Org. Chem., 1995, 8, 15-25. [all data]
Rogers and McLafferty, 1971
Rogers, D.W.; McLafferty, F.J.,
A new hydrogen calorimeter. Heats of hydrogenation of allyl and vinyl unsaturation adjacent to a ring,
Tetrahedron, 1971, 27, 3765-3775. [all data]
Davis, Allinger, et al., 1985
Davis, H.E.; Allinger, N.L.; Rogers, D.W.,
Enthalpies of hydrogenation of phenylalkynes: indirect determination of the enthalpy of formation of diphenylcyclopropenone,
J. Org. Chem., 1985, 50, 3601-3604. [all data]
Miki, 1975
Miki, Y.,
The thermodynamic properties of C9H18 naphthenes. I. The determination of the equilibrium constants of the hydrogenation of propyl- and isopropylbenzene and ethyltoluenes,
Bull. Chem. Soc. Jpn., 1975, 48, 201-208. [all data]
Hunter and Lias, 1998
Hunter, E.P.; Lias, S.G.,
Evaluated Gas Phase Basicities and Proton Affinities of Molecules: An Update,
J. Phys. Chem. Ref. Data, 1998, 27, 3, 413-656, https://doi.org/10.1063/1.556018
. [all data]
Takahashi and Kimura, 1992
Takahashi, M.; Kimura, K.,
Cation vibrational spectroscopy of trans and gauche n-propylbenzene rotational isomers. Two-color threshold photoelectron study and ab initio calculations,
J. Chem. Phys., 1992, 97, 2920. [all data]
Selim and Helal, 1982
Selim, E.T.M.; Helal, A.I.,
The study of C1-C3 monosubstituted alkyl benzenes by the inverse convolution of first differential ionization efficiency curves,
Org. Mass Spectrom., 1982, 17, 539. [all data]
McLoughlin, Morrison, et al., 1979
McLoughlin, R.G.; Morrison, J.D.; Traeger, J.C.,
Photoionization of the C-1 - C-4 monosubstituted alkyl benzenes: Thermochemistry of [C7H7]+ and [C8H9]+ formation,
Org. Mass Spectrom., 1979, 14, 104. [all data]
Lias and Ausloos, 1978
Lias, S.G.; Ausloos, P.J.,
eIonization energies of organic compounds by equilibrium measurements,
J. Am. Chem. Soc., 1978, 100, 6027. [all data]
Watanabe, 1957
Watanabe, K.,
Ionization potentials of some molecules,
J. Chem. Phys., 1957, 26, 542. [all data]
Tajima and Tsuchiya, 1973
Tajima, S.; Tsuchiya, T.,
Energetics consideration of C5H5+ ions produced from various precursors by electron impact,
Bull. Chem. Soc. Jpn., 1973, 46, 3291. [all data]
Loudon, Maccoll, et al., 1970
Loudon, A.G.; Maccoll, A.; Wong, S.K.,
Comparison between unimolecular gas phase pyrolysis and electron impact fragmentation. Part I. The mass spectra of tetralin and some related heterocycles,
J. Chem. Soc. B, 1970, 1727. [all data]