ytterbium trichloride
- Formula: Cl3Yb
- Molecular weight: 279.413
- CAS Registry Number: 10361-91-8

Reaction thermochemistry data

Data compiled by: John E. Bartmess
Individual Reactions
By formula: Cl- + Cl3Yb = (Cl- • Cl3Yb)
Quantity | Value | Units | Method | Reference | Comment |
---|---|---|---|---|---|
ΔrH° | 74.3 ± 7.2 | kcal/mol | TDAs | Kuznetsov, Kudin, et al., 1997 | gas phase; value altered from reference due to conversion from electron convention to ion convention |
ΔrH° | 83.2 ± 4.5 | kcal/mol | TDEq | Kudin, Vorob'ev, et al., 2007 | gas phase; value altered from reference due to conversion from electron convention to ion convention |

Gas phase ion energetics data

Data compiled by: Sharon G. Lias, John E. Bartmess, Joel F. Liebman, John L. Holmes, Rhoda D. Levin, and W. Gary Mallard
Ionization energy determinations
IE (eV) | Method | Reference | Comment |
---|---|---|---|
11.61 ± 0.05 | PE | Lee, Potts, et al., 1982 | Vertical value |
Appearance energy determinations
Ion | AE (eV) | Other Products | Method | Reference | Comment |
---|---|---|---|---|---|
Yb+ | 18.62 ± 0.07 | 3Cl | EI | Sapegin, Baluev, et al., 1984 |

Ion clustering data

Data compiled by: John E. Bartmess
Clustering reactions
By formula: Cl- + Cl3Yb = (Cl- • Cl3Yb)
Quantity | Value | Units | Method | Reference | Comment |
---|---|---|---|---|---|
ΔrH° | 74.3 ± 7.2 | kcal/mol | TDAs | Kuznetsov, Kudin, et al., 1997 | gas phase; value altered from reference due to conversion from electron convention to ion convention |
ΔrH° | 83.2 ± 4.5 | kcal/mol | TDEq | Kudin, Vorob'ev, et al., 2007 | gas phase; value altered from reference due to conversion from electron convention to ion convention |

References

Kuznetsov, Kudin, et al., 1997
Kuznetsov, A.Yu.; Kudin, L.S.; Pogrebnoi, A.M.; Butman, M.F.; Burdukovskaya, G.G.,
A Mass-spectrometric Study of the Neutral and Ionic Components of Ytterbium Chloride Vapor: The Enthalpies of Formation of YbCl2 and YbCl3 Molecules and YbCl3- and YbCl4- Ion in the Gas Phas,
Russ. J. Phys. Chem., 1997, 71, 216. [all data]
Kudin, Vorob'ev, et al., 2007
Kudin, L.S.; Vorob'ev, D.E.; Grishin, A.E.,
The Thermochemical Characteristics of the LnCl4- and Ln2Cl7- Negative Ions,
Russ. J. Phys. Chem., 2007, 81, 2, 147, https://doi.org/10.1134/S003602440702001X
. [all data]
Lee, Potts, et al., 1982
Lee, E.P.F.; Potts, A.W.; Bloor, J.E.,
HeI and HeII photoelectron spectra of lanthanide trichlorides in the vapour phase,
Proc. R. Soc. London A, 1982, 381, 373. [all data]
Sapegin, Baluev, et al., 1984
Sapegin, A.M.; Baluev, A.V.; Evdokimov, V.I.,
Mass-spectrometric investigation of the thermochemistry of the chlorides of the lanthanides,
Russ. J. Phys. Chem., 1984, 58, 1792. [all data]