praseodymium trichloride
- Formula: Cl3Pr
- Molecular weight: 247.267
- CAS Registry Number: 10361-79-2

Phase change data

Data compiled by: William E. Acree, Jr., James S. Chickos
Quantity | Value | Units | Method | Reference | Comment |
---|---|---|---|---|---|
ΔsubH° | 340. ± 4. | kJ/mol | N/A | Villani, Brunetti, et al., 2000 | |
ΔsubH° | 324. | kJ/mol | N/A | Villani, Brunetti, et al., 2000 |
Enthalpy of sublimation
ΔsubH (kJ/mol) | Temperature (K) | Method | Reference |
---|---|---|---|
317. ± 4. | 1000. | TE | Villani, Brunetti, et al., 2000 |

Gas phase ion energetics data

Data compiled by: Sharon G. Lias, John E. Bartmess, Joel F. Liebman, John L. Holmes, Rhoda D. Levin, and W. Gary Mallard
Ionization energy determinations
IE (eV) | Method | Reference | Comment |
---|---|---|---|
11.43 ± 0.02 | PE | Lee, Potts, et al., 1982 | Vertical value |
Appearance energy determinations
Ion | AE (eV) | Other Products | Method | Reference | Comment |
---|---|---|---|---|---|
Pr+ | 20.45 ± 0.08 | 3Cl | EI | Sapegin, Baluev, et al., 1984 |

References

Villani, Brunetti, et al., 2000
Villani, Anna Rita; Brunetti, Bruno; Piacente, Vincenzo,
Vapor Pressures and Sublimation Enthalpies of Praseodymium Trichloride, Tribromide, and Triiodide,
J. Chem. Eng. Data, 2000, 45, 6, 1167-1172, https://doi.org/10.1021/je0001532
. [all data]
Lee, Potts, et al., 1982
Lee, E.P.F.; Potts, A.W.; Bloor, J.E.,
HeI and HeII photoelectron spectra of lanthanide trichlorides in the vapour phase,
Proc. R. Soc. London A, 1982, 381, 373. [all data]
Sapegin, Baluev, et al., 1984
Sapegin, A.M.; Baluev, A.V.; Evdokimov, V.I.,
Mass-spectrometric investigation of the thermochemistry of the chlorides of the lanthanides,
Russ. J. Phys. Chem., 1984, 58, 1792. [all data]