Sodium metaphosphate
- Formula: NaO3P
- Molecular weight: 101.9617
- IUPAC Standard InChIKey: AQMNWCRSESPIJM-UHFFFAOYSA-M
- CAS Registry Number: 10361-03-2
- Chemical structure:
View 3d structure (requires JavaScript / HTML 5) - Species with the same structure:

Gas phase ion energetics data

Data compiled by: Sharon G. Lias, Rhoda D. Levin, and Sherif A. Kafafi
Ionization energy determinations
IE (eV) | Method | Reference | Comment |
---|---|---|---|
5.0 ± 0.8 | EI | Gingerich and Miller, 1975 | |
10.16 ± 0.04 | PE | Bowling, Allen, et al., 1979 | Vertical value |

References

Gingerich and Miller, 1975
Gingerich, K.A.; Miller, F.,
Thermodynamic study of gaseous sodium-phosphorus-oxygen ternary molecules by high temperature mass spectrometry,
J. Chem. Phys., 1975, 63, 1211. [all data]
Bowling, Allen, et al., 1979
Bowling, R.A.; Allen, J.D., Jr.; Schweitzer, G.K.,
The He(I) photoelectron spectra of gaseous alkali metaphosphates,
J. Electron Spectrosc. Relat. Phenom., 1979, 17, 25. [all data]