Butane, 2-(methylthio)-
- Formula: C5H12S
- Molecular weight: 104.214
- IUPAC Standard InChIKey: IJRCRFQMYAJPPO-UHFFFAOYSA-N
- CAS Registry Number: 10359-64-5
- Chemical structure:
View 3d structure (requires JavaScript / HTML 5) - Other names: Sulfide, sec-butyl methyl; sec-Butyl methyl sulfide; 2-(Methylthio)butane; Methyl sec-butyl sulfide; 3-Methyl-2-thiapentane; Methyl 2-butyl sulfide

Phase change data

Data compiled by: William E. Acree, Jr., James S. Chickos
Enthalpy of vaporization
ΔvapH (kJ/mol) | Temperature (K) | Reference | Comment |
---|---|---|---|
38.5 | 303. | Dykyj, Svoboda, et al., 1999 | Based on data from 288. to 418. K. |

Gas phase ion energetics data

Data compiled by: Sharon G. Lias, Rhoda D. Levin, and Sherif A. Kafafi
Appearance energy determinations
Ion | AE (eV) | Other Products | Method | Reference | Comment |
---|---|---|---|---|---|
CH3S+ | 12.9 | C2H5+C2H4 | EI | Broer and Weringa, 1980 | |
C3H7S+ | 10.3 ± 0.15 | C2H5 | EI | Broer and Weringa, 1980 |

Kovats' RI, non-polar column, isothermal

Column type | Active phase | Temperature (C) | I | Reference | Comment |
---|---|---|---|---|---|
Packed | Apiezon M | 130. | 780. | Garbuzov, Misharina, et al., 1985 | He or N2, Chromosorb W, AW-DMCS; Column length: 2.1 m |
Packed | Apiezon L | 110. | 784. | Martinu and Janák, 1970 | |
Packed | Apiezon L | 130. | 790. | Martinu and Janák, 1970 | |
Packed | Apiezon L | 150. | 796. | Martinu and Janák, 1970 |

Normal alkane RI, non-polar column, custom temperature program

Column type | Active phase | I | Reference | Comment |
---|---|---|---|---|
Capillary | Apiezon M | 780. | Liu, Cao, et al., 2005 | Program: not specified |
Capillary | Polydimethyl siloxanes | 773. | Zenkevich, 1998 | Program: not specified |
Capillary | SE-52 | 805. | van Langenhove and Schamp, 1986 | Column length: 100. m; Column diameter: 0.50 mm; Program: not specified |

References

Dykyj, Svoboda, et al., 1999
Dykyj, J.; Svoboda, J.; Wilhoit, R.C.; Frenkel, M.L.; Hall, K.R.,
Vapor Pressure of Chemicals: Part A. Vapor Pressure and Antoine Constants for Hydrocarbons and Sulfur, Selenium, Tellurium and Hydrogen Containing Organic Compounds, Springer, Berlin, 1999, 373. [all data]
Broer and Weringa, 1980
Broer, W.J.; Weringa, W.D.,
Potential energy profiles for the unimolecular reactions of [C3H7S]+ ions,
Org. Mass Spectrom., 1980, 15, 229. [all data]
Garbuzov, Misharina, et al., 1985
Garbuzov, V.G.; Misharina, T.A.; Aerov, A.F.; Golovnya, R.V.,
Gas chromatographic retention indices for sulphur(II)-containing organic substances,
J. Anal. Chem. USSR (Engl. Transl.), 1985, 40, 4, 576-586. [all data]
Martinu and Janák, 1970
Martinu, V.; Janák, J.,
Gas-liquid chromatographic retention data of some aliphatic and alicyclic sulphides,
J. Chromatogr., 1970, 52, 69-75, https://doi.org/10.1016/S0021-9673(01)96545-8
. [all data]
Liu, Cao, et al., 2005
Liu, L.; Cao, C.-Z.; Xie, B.; Zou, L.-K.,
Research of QSSR on chromatography retention index of sulfides and mercaptans,
Journal of Hunan University of Science and Technology, 2005, 20, 4, 74-80. [all data]
Zenkevich, 1998
Zenkevich, I.G.,
The Principle of Structural Analogy in the Calculation of Gas Chromatographic Retention Indices using Physico-Chemical Constants of Organic Compounds,
Zh. Anal. Khim. (Rus.), 1998, 53, 1, 43-49. [all data]
van Langenhove and Schamp, 1986
van Langenhove, H.; Schamp, N.,
Identification of Volatiles in the Head Space of Acid-Treated Phosphate Rock by Gas Chromatography-Mass Spectromety,
J. Chromatogr., 1986, 351, 65-75, https://doi.org/10.1016/S0021-9673(01)83473-7
. [all data]