Benzene, (isocyanomethyl)-
- Formula: C8H7N
- Molecular weight: 117.1479
- IUPAC Standard InChIKey: RIWNFZUWWRVGEU-UHFFFAOYSA-N
- CAS Registry Number: 10340-91-7
- Chemical structure:
View 3d structure (requires JavaScript / HTML 5) - Other names: Benzyl isocyanide; Benzyl isonitrile

Condensed phase thermochemistry data

Data compiled by: Hussein Y. Afeefy, Joel F. Liebman, and Stephen E. Stein
Quantity | Value | Units | Method | Reference | Comment |
---|---|---|---|---|---|
ΔcH°liquid | -4373.74 | kJ/mol | Ccb | Lemoult and Jungfleisch, 1909 |

Gas phase ion energetics data

Data compiled as indicated in comments:
LLK - Sharon G. Lias, Rhoda D. Levin, and Sherif A. Kafafi
RDSH - Henry M. Rosenstock, Keith Draxl, Bruce W. Steiner, and John T. Herron
Ionization energy determinations
IE (eV) | Method | Reference | Comment |
---|---|---|---|
9.61 ± 0.05 | EI | Distefano, Innorta, et al., 1968 | RDSH |
9.47 | PE | Young and Cheng, 1976 | Vertical value; LLK |

References

Lemoult and Jungfleisch, 1909
Lemoult, M.P.; Jungfleisch, M.E.,
Thermochimie. - Comparaisons entre les nitriles et les carbylamines,
Compt. Rend., 1909, 148, 1602-1604. [all data]
Distefano, Innorta, et al., 1968
Distefano, G.; Innorta, G.; Pignataro, S.; Foffani, A.,
Correlation between the ionization potentials of transition metal complexes and of the corresponding ligands,
J. Organometal. Chem., 1968, 14, 165. [all data]
Young and Cheng, 1976
Young, V.Y.; Cheng, K.L.,
The ultraviolet photoelectron spectra of aliphatic aromatic isonitriles,
J. Electron Spectrosc. Relat. Phenom., 1976, 9, 317. [all data]