(E)-Stilbene
- Formula: C14H12
- Molecular weight: 180.2451
- IUPAC Standard InChIKey: PJANXHGTPQOBST-VAWYXSNFSA-N
- CAS Registry Number: 103-30-0
- Chemical structure:
View 3d structure (requires JavaScript / HTML 5) - Stereoisomers:
- Other names: Benzene, 1,1'-(1,2-ethenediyl)bis-, (E)-; Stilbene, (E)-; (E)-1,2-Diphenylethylene; trans-α,β-Diphenylethylene; trans-Stilbene; trans-1,2-Diphenylethene; trans-1,2-Diphenylethylene; (E)-1,2-Diphenylethene; Dibenzal, (E)-; Dibenzylidne, (E)-; 1,2-Diphenylethylene (trans); (1,2-Ethenediyl)-1,1'-bisbenzene, (E)-; Stilbene (trans); 1,trans-2-Diphenylethene; 1,trans-2-Diphenylethylene; trans-Diphenylethene; 1,2-Diphenylethene, (E)-; 1,1'-(1,2-Ethanediyl)bis[benzene], trans; Toluylene; t-Stilbene; trans-Bibenzal; trans-Bibenzylidene; Benzene, 1,1'-(1E)-1,2-ethenediylbis-; NSC 2069; 1,1'-(1,2-Ethanediyl)bis(benzene), (E)-

Gas phase thermochemistry data

Data compiled as indicated in comments:
DRB - Donald R. Burgess, Jr.
ALS - Hussein Y. Afeefy, Joel F. Liebman, and Stephen E. Stein
Quantity | Value | Units | Method | Reference | Comment |
---|---|---|---|---|---|
ΔfH°gas | 219.6 | kJ/mol | N/A | Lobanov and Karmanova, 1971 | Value computed using ΔfHsolid° value of 133.0±0.8 kj/mol from Lobanov and Karmanova, 1971 and ΔsubH° value of 86.6 kj/mol from Marantz and Armstrong, 1968.; DRB |
ΔfH°gas | 223.3 | kJ/mol | Ccb | Marantz and Armstrong, 1968 | see Marantz and Armstrong, 1968, 2; ALS |
ΔfH°gas | 224.4 | kJ/mol | N/A | Richardson and Parks, 1939 | Value computed using ΔfHsolid° value of 137.8±2.8 kj/mol from Richardson and Parks, 1939 and ΔsubH° value of 86.6 kj/mol from Marantz and Armstrong, 1968.; DRB |

Condensed phase thermochemistry data

Data compiled as indicated in comments:
ALS - Hussein Y. Afeefy, Joel F. Liebman, and Stephen E. Stein
DH - Eugene S. Domalski and Elizabeth D. Hearing
Quantity | Value | Units | Method | Reference | Comment |
---|---|---|---|---|---|
ΔcH°liquid | -7360.99 ± 0.50 | kJ/mol | Ccb | Yates and McDonald, 1971 | Corresponding ΔfHºliquid = 136.9 kJ/mol (simple calculation by NIST; no Washburn corrections); ALS |
Quantity | Value | Units | Method | Reference | Comment |
ΔfH°solid | 133. ± 0.8 | kJ/mol | Ccb | Lobanov and Karmanova, 1971 | ALS |
ΔfH°solid | 136.7 | kJ/mol | Ccb | Marantz and Armstrong, 1968 | see Marantz and Armstrong, 1968, 2; ALS |
ΔfH°solid | 137.8 ± 2.8 | kJ/mol | Ccb | Richardson and Parks, 1939 | Reanalyzed by Cox and Pilcher, 1970, Original value = 135.9 kJ/mol; ALS |
Quantity | Value | Units | Method | Reference | Comment |
ΔcH°solid | -7357.1 ± 0.8 | kJ/mol | Ccb | Lobanov and Karmanova, 1971 | Corresponding ΔfHºsolid = 133. kJ/mol (simple calculation by NIST; no Washburn corrections); ALS |
ΔcH°solid | -7360.8 ± 3.9 | kJ/mol | Ccb | Marantz and Armstrong, 1968 | see Marantz and Armstrong, 1968, 2; Corresponding ΔfHºsolid = 136.7 kJ/mol (simple calculation by NIST; no Washburn corrections); ALS |
ΔcH°solid | -7364.6 ± 1.0 | kJ/mol | Ccb | Coops and Hoijtink, 1950 | Reanalyzed by Cox and Pilcher, 1970, Original value = -7361. ± 0.51 kJ/mol; Corresponding ΔfHºsolid = 140.48 kJ/mol (simple calculation by NIST; no Washburn corrections); ALS |
ΔcH°solid | -7361.9 ± 2.8 | kJ/mol | Ccb | Richardson and Parks, 1939 | Reanalyzed by Cox and Pilcher, 1970, Original value = -7358.82 kJ/mol; Corresponding ΔfHºsolid = 137.7 kJ/mol (simple calculation by NIST; no Washburn corrections); ALS |
Quantity | Value | Units | Method | Reference | Comment |
S°solid,1 bar | 247.0 | J/mol*K | N/A | Van Miltenburg and Bouwstra, 1984 | DH |
Constant pressure heat capacity of solid
Cp,solid (J/mol*K) | Temperature (K) | Reference | Comment |
---|---|---|---|
251.08 | 320. | Bouwstra, De Leeuw, et al., 1985 | T = 320 to 410 K.; DH |
235.0 | 298.15 | Van Miltenburg and Bouwstra, 1984 | T = 8 to 350 K.; DH |

Phase change data

Data compiled as indicated in comments:
TRC - Thermodynamics Research Center, NIST Boulder Laboratories, Chris Muzny director
BS - Robert L. Brown and Stephen E. Stein
AC - William E. Acree, Jr., James S. Chickos
ALS - Hussein Y. Afeefy, Joel F. Liebman, and Stephen E. Stein
DRB - Donald R. Burgess, Jr.
DH - Eugene S. Domalski and Elizabeth D. Hearing
Quantity | Value | Units | Method | Reference | Comment |
---|---|---|---|---|---|
Tboil | 579.55 | K | N/A | Lecat, 1943 | Uncertainty assigned by TRC = 0.5 K; TRC |
Quantity | Value | Units | Method | Reference | Comment |
Tfus | 396. ± 2. | K | AVG | N/A | Average of 7 values; Individual data points |
Quantity | Value | Units | Method | Reference | Comment |
Ttriple | 397.40 | K | N/A | Bouwstra, deLeeuw, et al., 1985 | Uncertainty assigned by TRC = 0.02 K; TRC |
Ttriple | 398. | K | N/A | van Miltenburg and Bouwstra, 1984 | Uncertainty assigned by TRC = 0.5 K; TRC |
Quantity | Value | Units | Method | Reference | Comment |
ΔvapH° | 79.7 | kJ/mol | CGC | Chickos, Hesse, et al., 1998 | AC |
ΔvapH° | 79.8 | kJ/mol | CGC | Chickos, Hosseini, et al., 1995 | Based on data from 453. to 503. K.; AC |
ΔvapH° | 79.6 | kJ/mol | CGC | Chickos, Hosseini, et al., 1995 | Based on data from 403. to 453. K.; AC |
Quantity | Value | Units | Method | Reference | Comment |
ΔsubH° | 98. ± 10. | kJ/mol | AVG | N/A | Average of 6 values; Individual data points |
Reduced pressure boiling point
Tboil (K) | Pressure (bar) | Reference | Comment |
---|---|---|---|
579.2 | 0.992 | Aldrich Chemical Company Inc., 1990 | BS |
439.7 | 0.016 | Weast and Grasselli, 1989 | BS |
Enthalpy of vaporization
ΔvapH (kJ/mol) | Temperature (K) | Method | Reference | Comment |
---|---|---|---|---|
65.5 | 434. | A | Stephenson and Malanowski, 1987 | Based on data from 419. to 580. K.; AC |
Enthalpy of sublimation
ΔsubH (kJ/mol) | Temperature (K) | Method | Reference | Comment |
---|---|---|---|---|
99.6 | 313. | A | Stephenson and Malanowski, 1987 | Based on data from 298. to 343. K.; AC |
103.8 ± 2.5 | 315. | N/A | Kratt, Beckhaus, et al., 1983 | Based on data from 293. to 338. K.; AC |
86.5 ± 0.1 | 309. | TM | Engelsman, 1955 | Based on data from 303. to 315. K.; AC |
90.8 ± 0.8 | 329. | V | Wolf and Weghofer, 1938 | ALS |
Enthalpy of fusion
ΔfusH (kJ/mol) | Temperature (K) | Method | Reference | Comment |
---|---|---|---|---|
27.370 | 398. | N/A | Van Miltenburg and Bouwstra, 1984 | DH |
27.4 | 398.2 | N/A | Acree, 1991 | AC |
27.7 | 397.4 | AC | Bouwstra, Leeuw, et al., 1985 | AC |
Entropy of fusion
ΔfusS (J/mol*K) | Temperature (K) | Reference | Comment |
---|---|---|---|
68.8 | 398. | Van Miltenburg and Bouwstra, 1984 | DH |
Enthalpy of phase transition
ΔHtrs (kJ/mol) | Temperature (K) | Initial Phase | Final Phase | Reference | Comment |
---|---|---|---|---|---|
27.690 | 397.40 | crystaline, I | liquid | Bouwstra, De Leeuw, et al., 1985 | DH |
Entropy of phase transition
ΔStrs (J/mol*K) | Temperature (K) | Initial Phase | Final Phase | Reference | Comment |
---|---|---|---|---|---|
69.6 | 397.40 | crystaline, I | liquid | Bouwstra, De Leeuw, et al., 1985 | DH |

Reaction thermochemistry data

Data compiled by: Hussein Y. Afeefy, Joel F. Liebman, and Stephen E. Stein
Individual Reactions
By formula: C14H12 + H2 = C14H14
Quantity | Value | Units | Method | Reference | Comment |
---|---|---|---|---|---|
ΔrH° | -77.78 ± 0.84 | kJ/mol | Chyd | Williams, 1942 | liquid phase; solvent: Acetic acid; Reanalyzed by Cox and Pilcher, 1970, Original value = -84.2 ± 1.5 kJ/mol; At 302 K |
By formula: C14H12 = C14H12
Quantity | Value | Units | Method | Reference | Comment |
---|---|---|---|---|---|
ΔrH° | 35. ± 23. | kJ/mol | Cpha | Herman and Goodman, 1989 | solid phase; solvent: Acetonitrile/water |
ΔrH° | 19.2 ± 0.4 | kJ/mol | Ciso | Saltiel, Ganapathy, et al., 1987 | gas phase; At 303.2-461.2 K |
By formula: C14H12 = C14H12
Quantity | Value | Units | Method | Reference | Comment |
---|---|---|---|---|---|
ΔrH° | -5.0 ± 0.4 | kJ/mol | Cm | Bastianelli, Caia, et al., 1991 | liquid phase; Thermal Isomerization |
ΔrH° | -12. ± 1. | kJ/mol | Ciso | Fischer, Muszkat, et al., 1968 | solid phase; solvent: Cyclohexane |

Gas phase ion energetics data

Data evaluated as indicated in comments:
L - Sharon G. Lias
Data compiled as indicated in comments:
LL - Sharon G. Lias and Joel F. Liebman
LLK - Sharon G. Lias, Rhoda D. Levin, and Sherif A. Kafafi
B - John E. Bartmess
Quantity | Value | Units | Method | Reference | Comment |
---|---|---|---|---|---|
IE (evaluated) | 7.656 ± 0.001 | eV | N/A | N/A | L |
Electron affinity determinations
EA (eV) | Method | Reference | Comment |
---|---|---|---|
0.390 ± 0.020 | LPES | Vogeler, Siegert, et al., 2011 | B |
<0.390 ± 0.061 | ECD | Wojnarovits and Foldiak, 1981 | (E) isomer. EA is an upper limit: Chen and Wentworth, 1989. G3MP2B3 calculations indicate an EA of ca. 0.4 eV; B |
Ionization energy determinations
IE (eV) | Method | Reference | Comment |
---|---|---|---|
7.6558 ± 0.0005 | TE | Takahashi and Kimura, 1995 | LL |
7.70 ± 0.02 | PE | Maier and Turner, 1973 | LLK |
7.70 ± 0.03 | PI | Potapov, Kardash, et al., 1972 | LLK |
7.76 | PE | Dewar and Goodman, 1972 | LLK |
7.87 | PE | Kobayashi, Yokota, et al., 1975 | Vertical value; LLK |
7.90 ± 0.05 | PE | Distefano, Mazzucato, et al., 1975 | Vertical value; LLK |
7.91 ± 0.05 | PE | Goetz, Marschner, et al., 1974 | Vertical value; LLK |

Kovats' RI, non-polar column, custom temperature program

Column type | Active phase | I | Reference | Comment |
---|---|---|---|---|
Packed | SE-30 | 1755. | Ramsey, Lee, et al., 1980 | He, Chromosorb G HP (80-100 mesh); Column length: 1.5 m; Program: not specified |

Kovats' RI, polar column, isothermal

Column type | Active phase | Temperature (C) | I | Reference | Comment |
---|---|---|---|---|---|
Capillary | SP-1000 | 185. | 2547. | Kríz, Popl, et al., 1974 | N2; Column length: 50. m; Column diameter: 0.25 mm |

Van Den Dool and Kratz RI, non-polar column, temperature ramp

Column type | Active phase | I | Reference | Comment |
---|---|---|---|---|
Capillary | SE-52 | 1686. | Carugno and Rossi, 1967 | N2, 1.8 K/min; Column length: 65. m; Column diameter: 0.3 mm; Tstart: 100. C; Tend: 300. C |

Van Den Dool and Kratz RI, polar column, temperature ramp

Column type | Active phase | I | Reference | Comment |
---|---|---|---|---|
Capillary | HP-Innowax | 2536. | Adamiec, Rossner, et al., 2001 | 30. m/0.25 mm/0.25 μm, N2, 5. K/min; Tstart: 60. C; Tend: 220. C |

Normal alkane RI, non-polar column, custom temperature program

Column type | Active phase | I | Reference | Comment |
---|---|---|---|---|
Other | Methyl Silicone | 1755. | Ardrey and Moffat, 1981 | Program: not specified |

References

Lobanov and Karmanova, 1971
Lobanov, G.A.; Karmanova, L.P.,
Enthalpy of formation of some organic substances,
Izv. Vyssh. Uchebn. Zaved., Khim. Khim. Tekhnol., 1971, 14, 865-867. [all data]
Marantz and Armstrong, 1968
Marantz, S.; Armstrong, G.T.,
Heats of combustion of trans-stilbene and trans-2,2',4,',6,6'-hexanitrostilbene (HNS) (Correction),
J. Chem. Eng. Data, 1968, 13, 455. [all data]
Marantz and Armstrong, 1968, 2
Marantz, S.; Armstrong, G.T.,
Heats of combustion of trans-stilbene and trans-2,2',4,4',6,6'-hexanitrostilbene (HNS),
J. Chem. Eng. Data, 1968, 13, 118-121. [all data]
Richardson and Parks, 1939
Richardson, J.W.; Parks, G.S.,
Thermal data on organic compounds. XIX. Modern combustion data for some non-volatile compounds containing carbon, hydrogen and oxygen,
J. Am. Chem. Soc., 1939, 61, 3543-3546. [all data]
Yates and McDonald, 1971
Yates, K.; McDonald, R.S.,
A thermochemical probe into the mechanism of electrophilic addition to olefins,
J. Am. Chem. Soc., 1971, 93, 6297-6299. [all data]
Cox and Pilcher, 1970
Cox, J.D.; Pilcher, G.,
Thermochemistry of Organic and Organometallic Compounds, Academic Press, New York, 1970, 1-636. [all data]
Coops and Hoijtink, 1950
Coops, J.; Hoijtink, G.J.,
Thermochemical investigations on arylethenes. I. Heats of combustion of phenylethenes,
Recl. Trav. Chim. Pays-Bas, 1950, 69, 358-367. [all data]
Van Miltenburg and Bouwstra, 1984
Van Miltenburg, J.C.; Bouwstra, J.A.,
Thermodynamic properties of trans-azobenzene and trans-stilbene,
J. Chem. Thermodynam., 1984, 16, 61-65. [all data]
Bouwstra, De Leeuw, et al., 1985
Bouwstra, J.A.; De Leeuw, V.V.; Van Miltenburg, J.C.,
Properties of mixed-crystalline organic material prepared by zone levelling. IV. Melting properties and excess enthalpies of (trans-azobenzene + trans-stilbene),
J. Chem. Thermodynam., 1985, 17, 685-695. [all data]
Lecat, 1943
Lecat, M.,
Azeotropes of Ethyl Urethane and other Azeotropes,
C. R. Hebd. Seances Acad. Sci., 1943, 217, 273. [all data]
Bouwstra, deLeeuw, et al., 1985
Bouwstra, J.A.; deLeeuw, V.V.; van Miltenburg, J.C.,
Properties of mixed-crystalline organic material prepared by zone levelling 4. melting properties and excess enthalpies of (trans-azobenzene + trans-stilbene),
J. Chem. Thermodyn., 1985, 17, 685. [all data]
van Miltenburg and Bouwstra, 1984
van Miltenburg, J.C.; Bouwstra, J.A.,
Thermodynamic properties of trans-azobenzene and trans-stilbene,
J. Chem. Thermodyn., 1984, 16, 61-5. [all data]
Chickos, Hesse, et al., 1998
Chickos, James; Hesse, Donald; Hosseini, Sarah; Nichols, Gary; Webb, Paul,
Sublimation enthalpies at 298.15K using correlation gas chromatography and differential scanning calorimetry measurements,
Thermochimica Acta, 1998, 313, 2, 101-110, https://doi.org/10.1016/S0040-6031(97)00432-2
. [all data]
Chickos, Hosseini, et al., 1995
Chickos, James S.; Hosseini, Sarah; Hesse, Donald G.,
Determination of vaporization enthalpies of simple organic molecules by correlations of changes in gas chromatographic net retention times,
Thermochimica Acta, 1995, 249, 41-62, https://doi.org/10.1016/0040-6031(95)90670-3
. [all data]
Aldrich Chemical Company Inc., 1990
Aldrich Chemical Company Inc.,
Catalog Handbook of Fine Chemicals, Aldrich Chemical Company, Inc., Milwaukee WI, 1990, 1. [all data]
Weast and Grasselli, 1989
CRC Handbook of Data on Organic Compounds, 2nd Editon, Weast,R.C and Grasselli, J.G., ed(s)., CRC Press, Inc., Boca Raton, FL, 1989, 1. [all data]
Stephenson and Malanowski, 1987
Stephenson, Richard M.; Malanowski, Stanislaw,
Handbook of the Thermodynamics of Organic Compounds, 1987, https://doi.org/10.1007/978-94-009-3173-2
. [all data]
Kratt, Beckhaus, et al., 1983
Kratt, G.; Beckhaus, H.D.; Bernioehr, W.; Ruechardt, C.,
Thermolabile hydrocarbons. XVII. Enthalpies of combustion and formation of ten sym-tetraalkyl-1,2-diarylethanes,
Thermochim. Acta, 1983, 62, 279-294. [all data]
Engelsman, 1955
Engelsman, J.J.,
, Ph.D. Thesis, Vrije Universiteit Te Amsterdam, 1955. [all data]
Wolf and Weghofer, 1938
Wolf, K.L.; Weghofer, H.,
Uber sublimationswarmen,
Z. Phys. Chem., 1938, 39, 194-208. [all data]
Acree, 1991
Acree, William E.,
Thermodynamic properties of organic compounds: enthalpy of fusion and melting point temperature compilation,
Thermochimica Acta, 1991, 189, 1, 37-56, https://doi.org/10.1016/0040-6031(91)87098-H
. [all data]
Bouwstra, Leeuw, et al., 1985
Bouwstra, J.A.; Leeuw, V.V. de; Miltenburg, J.C. van,
Properties of mixed-crystalline organic material prepared by zone levelling IV. Melting properties and excess enthalpies of (trans-azobenzene + trans-stilbene),
The Journal of Chemical Thermodynamics, 1985, 17, 7, 685-695, https://doi.org/10.1016/0021-9614(85)90123-5
. [all data]
Williams, 1942
Williams, R.B.,
Heats of catalytic hydrogenation in solution. I. Apparatus, technique, and the heats of hydrogenation of certain pairs of stereoisomers,
J. Am. Chem. Soc., 1942, 64, 1395-1404. [all data]
Herman and Goodman, 1989
Herman, M.S.; Goodman, J.L.,
Determination of the enthalpy and reaction volume changes of organic photoreactions using photoacoustic calorimetry,
J. Am. Chem. Soc., 1989, 111, 1849-1854. [all data]
Saltiel, Ganapathy, et al., 1987
Saltiel, J.; Ganapathy, S.; Werking, C.,
The ΔH for thermal trans-stilbene/cis-stilbene isomerization. Do S0 and T1 potential energy curves cross?,
J. Phys. Chem., 1987, 91, 2755-2758. [all data]
Bastianelli, Caia, et al., 1991
Bastianelli, C.; Caia, V.; Cum, G.; Gallo, R.; Mancini, V.,
Thermal isomerization of photochemically synthesized (Z)-9-styrylacridines. An unusually high enthalpy of Z->E conversion for stilbene-like compounds,
J. Chem. Soc. Perkin Trans. 2, 1991, 679-683. [all data]
Fischer, Muszkat, et al., 1968
Fischer, G.; Muszkat, K.A.; Fischer, E.,
Thermodynamic equilibrium between cis- and trans-isomers in stilbene and some derivatives,
J. Chem. Soc. B, 1968, 1156-1158. [all data]
Vogeler, Siegert, et al., 2011
Vogeler, F.; Siegert, S.; Marian, C.M.; Weinkauf, R.,
T-1, T-2 State Energies and Electron Affinities of Small alpha,omega-Diphenylpolyenes Investigated by Anion Photodetachment Photoelectron Spectroscopy and Excited-State Theory,
Chemphyschem, 2011, 12, 10, 1948-1956, https://doi.org/10.1002/cphc.201001083
. [all data]
Wojnarovits and Foldiak, 1981
Wojnarovits, L.; Foldiak, G.,
Electron capture detection of aromatic hydrocarbons,
J. Chromatogr. Sci., 1981, 206, 511. [all data]
Chen and Wentworth, 1989
Chen, E.C.M.; Wentworth, W.E.,
Experimental Determination of Electron Affinities of Organic Molecules,
Mol. Cryst. Liq. Cryst., 1989, 171, 271. [all data]
Takahashi and Kimura, 1995
Takahashi, M.; Kimura, K.,
ZEKE Photoelectron spectra of trans-stilbene in the S1 state,
J. Phys. Chem., 1995, 99, 1628. [all data]
Maier and Turner, 1973
Maier, J.P.; Turner, D.W.,
Steric inhibition of resonance studied by molecular photoelectron spectroscopy. Part 2. Phenylethylenes,
J. Chem. Soc. Faraday Trans. 2, 1973, 69, 196. [all data]
Potapov, Kardash, et al., 1972
Potapov, V.K.; Kardash, I.E.; Sorokin, V.V.; Sokolov, S.A.; Evlasheva, T.I.,
Photoionization of heteroaromatic compounds,
Khim. Vys. Energ., 1972, 6, 392. [all data]
Dewar and Goodman, 1972
Dewar, M.J.S.; Goodman, D.W.,
Photoelectron spectra of molecules. Part 5.--Polycyclic aromatic hydrocarbons,
J. Chem. Soc. Faraday Trans. 2, 1972, 68, 1784. [all data]
Kobayashi, Yokota, et al., 1975
Kobayashi, T.; Yokota, K.; Nagakura, S.,
Photoelectron spectra of the cis- trans-isomers of some ethylene derivatives,
Bull. Chem. Soc. Jpn., 1975, 48, 412. [all data]
Distefano, Mazzucato, et al., 1975
Distefano, G.; Mazzucato, U.; Modelli, A.; Pignataro, S.; Orlandi, G.,
Photoelectron (He I) spectroscopic study of styrylpyridines,
J. Chem. Soc. Faraday Trans. 2, 1975, 71, 1583. [all data]
Goetz, Marschner, et al., 1974
Goetz, H.; Marschner, F.; Juds, H.,
Zur n-pi Wechselwirkung im Benzalanilin,
Tetrahedron, 1974, 30, 1133. [all data]
Rodebush and Feldman, 1946
Rodebush, W.H.; Feldman, I.,
Ultraviolet absorption spectra of organic molecules. III. Mechanical interference of substituent groups with resonance configurations,
J. Am. Chem. Soc., 1946, 68, 896-899. [all data]
Ramsey, Lee, et al., 1980
Ramsey, J.D.; Lee, T.D.; Osselton, M.D.; Moffat, A.C.,
Gas-liquid chromatographic retention indices of 296 non-drug substances on SE-30 or OV-1 likely to be encountered in toxicological analyses,
J. Chromatogr., 1980, 184, 2, 185-206, https://doi.org/10.1016/S0021-9673(00)85641-1
. [all data]
Kríz, Popl, et al., 1974
Kríz, J.; Popl, M.; Mostecký, J.,
Retention indices of biphenyls and diphenylalkanes,
J. Chromatogr., 1974, 97, 1, 3-13, https://doi.org/10.1016/S0021-9673(01)97577-6
. [all data]
Carugno and Rossi, 1967
Carugno, N.; Rossi, S.,
Evaluation of polynuclear hydrocarbons in cigarette smoke by glass capillary columns,
J. Gas Chromatogr., 1967, 5, 2, 103-106, https://doi.org/10.1093/chromsci/5.2.103
. [all data]
Adamiec, Rossner, et al., 2001
Adamiec, J.; Rossner, J.; Velisek, J.; Cejpek, K.; Savel, J.,
Minor Strecker degradation products of phenylalanine and phenylglycine,
Eur. Food Res. Technol., 2001, 212, 2, 135-140, https://doi.org/10.1007/s002170000234
. [all data]
Ardrey and Moffat, 1981
Ardrey, R.E.; Moffat, A.C.,
Gas-liquid chromatographic retention indices of 1318 substances of toxicological interest on SE-30 or OV-1 stationary phase,
J. Chromatogr., 1981, 220, 3, 195-252, https://doi.org/10.1016/S0021-9673(00)81925-1
. [all data]