Bibenzyl
- Formula: C14H14
- Molecular weight: 182.2610
- IUPAC Standard InChIKey: QWUWMCYKGHVNAV-UHFFFAOYSA-N
- CAS Registry Number: 103-29-7
- Chemical structure:
View 3d structure (requires JavaScript / HTML 5) - Other names: Benzene, 1,1'-(1,2-ethanediyl)bis-; s-Diphenylethane; Dibenzil; Dibenzyl; Ethane, 1,2-diphenyl-; 1,2-Diphenylethane; Benzene, (phenylethyl)-; 1,2-Diphenylethane(sym); 1,2-Diphenylethane, s; sym-Diphenylethane; Dihydrostilbene; NSC 30686

Gas phase thermochemistry data

Data compiled as indicated in comments:
ALS - Hussein Y. Afeefy, Joel F. Liebman, and Stephen E. Stein
DRB - Donald R. Burgess, Jr.
Quantity | Value | Units | Method | Reference | Comment |
---|---|---|---|---|---|
ΔfH°gas | 135.6 ± 1.3 | kJ/mol | Ccb | Coleman and Pilcher, 1966 | ALS |
ΔfH°gas | 129.0 | kJ/mol | N/A | Parks, West, et al., 1946 | Value computed using ΔfHsolid° value of 44.9±3.1 kj/mol from Parks, West, et al., 1946 and ΔsubH° value of 84.1 kj/mol from Coleman and Pilcher, 1966.; DRB |

Condensed phase thermochemistry data

Data compiled as indicated in comments:
ALS - Hussein Y. Afeefy, Joel F. Liebman, and Stephen E. Stein
DH - Eugene S. Domalski and Elizabeth D. Hearing
Quantity | Value | Units | Method | Reference | Comment |
---|---|---|---|---|---|
ΔcH°liquid | -7562.6 ± 7.5 | kJ/mol | Ccb | Banse and Parks, 1933 | Reanalyzed by Cox and Pilcher, 1970, Original value = -7560.36 kJ/mol; Corresponding ΔfHºliquid = 52.63 kJ/mol (simple calculation by NIST; no Washburn corrections); ALS |
Quantity | Value | Units | Method | Reference | Comment |
ΔfH°solid | 51.5 ± 1.3 | kJ/mol | Ccb | Coleman and Pilcher, 1966 | ALS |
ΔfH°solid | 44.9 ± 3.1 | kJ/mol | Ccb | Parks, West, et al., 1946 | Reanalyzed by Cox and Pilcher, 1970, Original value = 44.06 ± 0.02 kJ/mol; ALS |
Quantity | Value | Units | Method | Reference | Comment |
ΔcH°solid | -7561.5 ± 1.1 | kJ/mol | Ccb | Coleman and Pilcher, 1966 | Corresponding ΔfHºsolid = 51.55 kJ/mol (simple calculation by NIST; no Washburn corrections); ALS |
ΔcH°solid | -7559.6 ± 1.0 | kJ/mol | Ccb | Coops, Mulder, et al., 1953 | Reanalyzed by Cox and Pilcher, 1970, Original value = -7559. ± 1. kJ/mol; See Coops, Mulder, et al., 1946; Corresponding ΔfHºsolid = 49.7 kJ/mol (simple calculation by NIST; no Washburn corrections); ALS |
ΔcH°solid | -7280. | kJ/mol | Ccb | Serijan and Wise, 1951 | Corresponding ΔfHºsolid = -230. kJ/mol (simple calculation by NIST; no Washburn corrections); ALS |
ΔcH°solid | -7594.4 | kJ/mol | Ccb | Wise, Serijan, et al., 1951 | Corresponding ΔfHºsolid = 84.5 kJ/mol (simple calculation by NIST; no Washburn corrections); ALS |
ΔcH°solid | -7554.8 ± 3.0 | kJ/mol | Ccb | Parks, West, et al., 1946 | Reanalyzed by Cox and Pilcher, 1970, Original value = -7554.1 ± 3.0 kJ/mol; Corresponding ΔfHºsolid = 44.85 kJ/mol (simple calculation by NIST; no Washburn corrections); ALS |
Quantity | Value | Units | Method | Reference | Comment |
S°solid,1 bar | 267.391 | J/mol*K | N/A | Messerly, Finke, et al., 1988 | crystaline, I phase; DH |
S°solid,1 bar | 270.3 | J/mol*K | N/A | Huffman, Parks, et al., 1930 | Extrapolation below 90 K, 90.37 J/mol*K.; DH |
Constant pressure heat capacity of solid
Cp,solid (J/mol*K) | Temperature (K) | Reference | Comment |
---|---|---|---|
253.764 | 298.15 | Messerly, Finke, et al., 1988 | crystaline, I phase; T = 10 to 400 K.; DH |
320.1 | 330. | Kurbatov, 1950 | Temperature 54 to 254°C. Mp = 52.8°C.; DH |
251.9 | 298.1 | Schmidt, 1941 | T = 20 to 200°C, equations only in t°C. Cp(c) = 0.2867 + 0.001743t cal/g*K (20 to 51°C); Cp(liq) = 0.3865 + 0.0005986t cal/g*K (51 to -200°C).; DH |
257.0 | 303. | Ferry and Thomas, 1933 | T = 303 to 343 K.; DH |
253.6 | 298.5 | Smith and Andrews, 1931 | T = 102 to 299 K. Value is unsmoothed experimental datum.; DH |
251.0 | 293.6 | Huffman, Parks, et al., 1930 | T = 93 to 294 K. Value is unsmoothed experimental datum.; DH |

Phase change data

Data compiled as indicated in comments:
BS - Robert L. Brown and Stephen E. Stein
TRC - Thermodynamics Research Center, NIST Boulder Laboratories, Chris Muzny director
AC - William E. Acree, Jr., James S. Chickos
ALS - Hussein Y. Afeefy, Joel F. Liebman, and Stephen E. Stein
DRB - Donald R. Burgess, Jr.
DH - Eugene S. Domalski and Elizabeth D. Hearing
CAL - James S. Chickos, William E. Acree, Jr., Joel F. Liebman, Students of Chem 202 (Introduction to the Literature of Chemistry), University of Missouri -- St. Louis
Quantity | Value | Units | Method | Reference | Comment |
---|---|---|---|---|---|
Tboil | 556. ± 5. | K | AVG | N/A | Average of 23 out of 24 values; Individual data points |
Quantity | Value | Units | Method | Reference | Comment |
Tfus | 325. ± 1. | K | AVG | N/A | Average of 189 out of 195 values; Individual data points |
Quantity | Value | Units | Method | Reference | Comment |
Ttriple | 324.340 | K | N/A | Messerly, Finke, et al., 1988, 2 | Crystal phase 1 phase; Uncertainty assigned by TRC = 0.01 K; TRC |
Quantity | Value | Units | Method | Reference | Comment |
ΔsubH° | 91.5 ± 0.7 | kJ/mol | B | Osborn and Scott, 1980 | AC |
ΔsubH° | 91.38 ± 0.46 | kJ/mol | V | Morawetz, 1972 | ALS |
ΔsubH° | 91.4 ± 0.5 | kJ/mol | C | Morawetz, 1972, 2 | AC |
ΔsubH° | 84.1 | kJ/mol | N/A | Coleman and Pilcher, 1966 | DRB |
ΔsubH° | 73.2 ± 0.8 | kJ/mol | V | Wolf and Weghofer, 1938 | ALS |
Enthalpy of vaporization
ΔvapH (kJ/mol) | Temperature (K) | Method | Reference | Comment |
---|---|---|---|---|
67.4 | 398. | GC | Lei, Chankalal, et al., 2002 | Based on data from 323. to 473. K.; AC |
64.1 | 373. | N/A | Sasse, N'guimbi, et al., 1989 | Based on data from 333. to 413. K.; AC |
67.53 ± 0.10 | 324.4 | V | Messerly, Finke, et al., 1988, 2 | ALS |
66.2 ± 0.2 | 340. | N/A | Messerly, Finke, et al., 1988 | AC |
57. | 374. | A | Stephenson and Malanowski, 1987 | Based on data from 359. to 557. K. See also Stull, 1947.; AC |
Antoine Equation Parameters
log10(P) = A − (B / (T + C))
P = vapor pressure (bar)
T = temperature (K)
View plot Requires a JavaScript / HTML 5 canvas capable browser.
Temperature (K) | A | B | C | Reference | Comment |
---|---|---|---|---|---|
360.0 to 557. | 4.86097 | 2572.151 | -27.406 | Stull, 1947 | Coefficents calculated by NIST from author's data. |
Enthalpy of sublimation
ΔsubH (kJ/mol) | Temperature (K) | Method | Reference | Comment |
---|---|---|---|---|
92.9 | 308. | EM | Sasse, N'guimbi, et al., 1989 | Based on data from 293. to 323. K.; AC |
91.2 ± 0.4 | 295. | N/A | Kratt, Beckhaus, et al., 1983 | Based on data from 273. to 318. K.; AC |
83.97 ± 0.46 | 326.2 | V | Aihara, 1959 | crystal phase; ALS |
84.1 ± 0.4 | 286. to 307. | V | Aihara, 1959, 2 | See also Cox and Pilcher, 1970, 2.; AC |
72.4 ± 1.3 | 304. | ME | Bloink, Pausacker, et al., 1951 | Based on data from 290. to 317. K.; AC |
Enthalpy of fusion
ΔfusH (kJ/mol) | Temperature (K) | Reference | Comment |
---|---|---|---|
22.73 | 324.3 | Domalski and Hearing, 1996 | AC |
23.010 | 324.4 | Schmidt, 1941 | DH |
22.573 | 324.3 | Ferry and Thomas, 1933 | DH |
Entropy of fusion
ΔfusS (J/mol*K) | Temperature (K) | Reference | Comment |
---|---|---|---|
70.9 | 324.4 | Schmidt, 1941 | DH |
Entropy of fusion
ΔfusS (J/mol*K) | Temperature (K) | Reference | Comment |
---|---|---|---|
8.23 | 273.2 | Domalski and Hearing, 1996 | CAL |
70.09 | 324.3 |
Enthalpy of phase transition
ΔHtrs (kJ/mol) | Temperature (K) | Initial Phase | Final Phase | Reference | Comment |
---|---|---|---|---|---|
2.24755 | 273.150 | crystaline, II | crystaline, I | Messerly, Finke, et al., 1988 | DH |
22.73052 | 324.348 | crystaline, I | liquid | Messerly, Finke, et al., 1988 | DH |
Entropy of phase transition
ΔStrs (J/mol*K) | Temperature (K) | Initial Phase | Final Phase | Reference | Comment |
---|---|---|---|---|---|
8.23 | 273.150 | crystaline, II | crystaline, I | Messerly, Finke, et al., 1988 | DH |
70.08 | 324.348 | crystaline, I | liquid | Messerly, Finke, et al., 1988 | DH |

Reaction thermochemistry data

Data compiled by: Hussein Y. Afeefy, Joel F. Liebman, and Stephen E. Stein
Individual Reactions
By formula: 2H2 + C14H10 = C14H14
Quantity | Value | Units | Method | Reference | Comment |
---|---|---|---|---|---|
ΔrH° | -249.5 ± 2.3 | kJ/mol | Chyd | Davis, Allinger, et al., 1985 | liquid phase; solvent: Hexane |
ΔrH° | -268.6 ± 4.6 | kJ/mol | Chyd | Flitcroft and Skinner, 1958 | solid phase; Reanalyzed by Cox and Pilcher, 1970, Original value = -268. ± 4.6 kJ/mol |
By formula: C14H12 + H2 = C14H14
Quantity | Value | Units | Method | Reference | Comment |
---|---|---|---|---|---|
ΔrH° | -77.78 ± 0.84 | kJ/mol | Chyd | Williams, 1942 | liquid phase; solvent: Acetic acid; Reanalyzed by Cox and Pilcher, 1970, Original value = -84.2 ± 1.5 kJ/mol; At 302 K |
By formula: H2 + C14H12 = C14H14
Quantity | Value | Units | Method | Reference | Comment |
---|---|---|---|---|---|
ΔrH° | -131.5 ± 0.84 | kJ/mol | Chyd | Williams, 1942 | liquid phase; solvent: Acetic acid; Reanalyzed by Cox and Pilcher, 1970, Original value = -108.0 ± 8.5 kJ/mol; At 302 K |

Gas phase ion energetics data

Data evaluated as indicated in comments:
HL - Edward P. Hunter and Sharon G. Lias
Data compiled as indicated in comments:
LLK - Sharon G. Lias, Rhoda D. Levin, and Sherif A. Kafafi
RDSH - Henry M. Rosenstock, Keith Draxl, Bruce W. Steiner, and John T. Herron
Quantity | Value | Units | Method | Reference | Comment |
---|---|---|---|---|---|
Proton affinity (review) | 801.8 | kJ/mol | N/A | Hunter and Lias, 1998 | HL |
Quantity | Value | Units | Method | Reference | Comment |
Gas basicity | 774.1 | kJ/mol | N/A | Hunter and Lias, 1998 | HL |
Ionization energy determinations
IE (eV) | Method | Reference | Comment |
---|---|---|---|
9.00 ± 0.05 | EI | Pignataro, Mancini, et al., 1972 | LLK |
8.7 ± 0.1 | EI | McLafferty, Wachs, et al., 1970 | RDSH |
9.1 | PE | Pignataro, Mancini, et al., 1971 | Vertical value; LLK |
Appearance energy determinations
Ion | AE (eV) | Other Products | Method | Reference | Comment |
---|---|---|---|---|---|
C7H7+ | 10.6 | C7H7 | EI | McLafferty, Wachs, et al., 1970 | RDSH |

Kovats' RI, non-polar column, isothermal

Column type | Active phase | Temperature (C) | I | Reference | Comment |
---|---|---|---|---|---|
Capillary | OV-101 | 140. | 1496.7 | Gerasimenko, Kirilenko, et al., 1981 | N2; Column length: 50. m; Column diameter: 0.3 mm |
Capillary | OV-101 | 160. | 1509.3 | Gerasimenko, Kirilenko, et al., 1981 | N2; Column length: 50. m; Column diameter: 0.3 mm |
Capillary | Apiezon L | 150. | 1546.3 | Shlyakhov, Novikova, et al., 1979 | He; Column length: 20. m; Column diameter: 0.3 mm |
Packed | SE-30 | 200. | 1539. | Shlyakhov, Anvaer, et al., 1975 | |
Packed | Apiezon L | 150. | 1541. | Shlyakhov, Anvaer, et al., 1975 | |
Packed | Apiezon L | 170. | 1563. | Kríz, Popl, et al., 1974 |

Kovats' RI, polar column, temperature ramp

Column type | Active phase | I | Reference | Comment |
---|---|---|---|---|
Capillary | Carbowax 20M | 2069. | Toda, Mihara, et al., 1983 | 2. K/min; Column length: 50. m; Column diameter: 0.23 mm; Tstart: 80. C; Tend: 200. C |
Capillary | Carbowax 20M | 2072. | Toda, Mihara, et al., 1983 | 2. K/min; Column length: 50. m; Column diameter: 0.23 mm; Tstart: 80. C; Tend: 200. C |

Van Den Dool and Kratz RI, non-polar column, temperature ramp

Column type | Active phase | I | Reference | Comment |
---|---|---|---|---|
Capillary | DB-5 | 1508.8 | Song, Lai, et al., 2003 | 30. m/0.25 mm/0.25 μm, He, 2. K/min; Tstart: 40. C; Tend: 310. C |
Capillary | DB-5 | 1519.2 | Song, Lai, et al., 2003 | 30. m/0.25 mm/0.25 μm, He, 4. K/min; Tstart: 40. C; Tend: 310. C |
Capillary | DB-5 | 1524.3 | Song, Lai, et al., 2003 | 30. m/0.25 mm/0.25 μm, He, 6. K/min; Tstart: 40. C; Tend: 310. C |
Capillary | DB-5 | 1508.8 | Lai and Song, 1995 | 30. m/0.25 mm/0.25 μm, He, 2. K/min; Tstart: 40. C; Tend: 310. C |
Capillary | DB-5 | 1519.2 | Lai and Song, 1995 | 30. m/0.25 mm/0.25 μm, He, 4. K/min; Tstart: 40. C; Tend: 310. C |
Capillary | DB-5 | 1524.3 | Lai and Song, 1995 | 30. m/0.25 mm/0.25 μm, He, 6. K/min; Tstart: 40. C; Tend: 310. C |
Capillary | DB-5 | 1528. | Rostad and Pereira, 1986 | 30. m/0.26 mm/0.25 μm, He, 50. C @ 4. min, 6. K/min, 300. C @ 20. min |

Van Den Dool and Kratz RI, polar column, temperature ramp

Column type | Active phase | I | Reference | Comment |
---|---|---|---|---|
Capillary | CP-WAX 57CB | 2070. | Baltes and Mevissen, 1988 | He, 50. C @ 5. min, 2. K/min; Column length: 50. m; Column diameter: 0.24 mm; Tend: 210. C |

Normal alkane RI, non-polar column, temperature ramp

Column type | Active phase | I | Reference | Comment |
---|---|---|---|---|
Capillary | HP-5 MS | 1525. | Radulovic, Blagojevic, et al., 2009 | 30. m/0.25 mm/0.25 μm, Helium, 5. K/min, 290. C @ 10. min; Tstart: 70. C |
Capillary | Ultra-1 | 1494. | Elizalde-González, Hutfliess, et al., 1996 | 50. m/0.2 mm/0.33 μm, H2, 3. K/min, 300. C @ 35. min; Tstart: 60. C |

Normal alkane RI, non-polar column, custom temperature program

Column type | Active phase | I | Reference | Comment |
---|---|---|---|---|
Capillary | DB-1 | 1516. | Peng, 1996 | 30. m/0.53 mm/1.5 μm; Program: 40 0C (4 min) 8 0C/min -> 200 0C (1 min) 5 0C/min -> 280 0C (20 min) |
Capillary | Polydimethyl siloxanes | 1489. | Zenkevich and Chupalov, 1996 | Program: not specified |
Capillary | DB-1 | 1487. | Hathcock and Bertsch, 1993 | 100. m/0.25 mm/0.5 μm; Program: not specified |

Normal alkane RI, polar column, custom temperature program

Column type | Active phase | I | Reference | Comment |
---|---|---|---|---|
Capillary | DB-Wax | 2061. | Peng, 1996 | 30. m/0.53 mm/1.0 μm; Program: 40 0C (4 min) 4 0C/min -> 200 0C (20 min) |
Capillary | DB-Wax | 2061. | Peng, Yang, et al., 1991 | Program: not specified |

Lee's RI, non-polar column, temperature ramp

Column type | Active phase | I | Reference | Comment |
---|---|---|---|---|
Capillary | CP Sil 8 CB | 260.4 | Bundt, Herbel, et al., 1991 | 50. m/0.25 mm/0.25 μm, He, 4. K/min; Tstart: 80. C; Tend: 300. C |
Capillary | SE-54 | 260.13 | Guillén, Blanco, et al., 1989 | 20. m/0.22 mm/0.20 μm, He, 4. K/min; Tstart: 50. C; Tend: 300. C |
Capillary | DB-5 | 260.49 | Rostad and Pereira, 1986 | 30. m/0.26 mm/0.25 μm, He, 50. C @ 4. min, 6. K/min, 300. C @ 20. min |

Lee's RI, non-polar column, custom temperature program

Column type | Active phase | I | Reference | Comment |
---|---|---|---|---|
Capillary | DB-5MS | 258.9 | Aracil, Font, et al., 2005 | Column length: 60. m; Column diameter: 0.25 mm; Program: not specified |
Capillary | CP Sil 8 CB | 260.1 | Bundt, Herbel, et al., 1991 | 50. m/0.25 mm/0.25 μm, He; Program: not specified |
Capillary | CP Sil 8 CB | 260.1 | Bundt, Herbel, et al., 1991 | 50. m/0.25 mm/0.25 μm, He; Program: not specified |

References

Coleman and Pilcher, 1966
Coleman, D.J.; Pilcher, G.,
Heats of combustion of biphenyl, bibenzyl, naphthalene, anthracene, and phenanthrene,
Trans. Faraday Soc., 1966, 62, 821-827. [all data]
Parks, West, et al., 1946
Parks, G.S.; West, T.J.; Naylor, B.F.; Fujii, P.S.; McClaine, L.A.,
Thermal data on organic compounds. XXIII. Modern combustion data for fourteen hydrocarbons and five polyhydroxy alcohols,
J. Am. Chem. Soc., 1946, 68, 2524-2527. [all data]
Banse and Parks, 1933
Banse, H.; Parks, G.S.,
Thermal data on organic compounds. XII. The heats of combustion of nine hydrocarbons,
J. Am. Chem. Soc., 1933, 55, 3223-3227. [all data]
Cox and Pilcher, 1970
Cox, J.D.; Pilcher, G.,
Thermochemistry of Organic and Organometallic Compounds, Academic Press, New York, 1970, 1-636. [all data]
Coops, Mulder, et al., 1953
Coops, J.; Mulder, D.; Dienske, J.W.; Smittenberg, J.,
Thermochemical investigations on arylethanes I. Heats of combustion of phenylethanes.,
Rec. Trav. Chim. Pays/Bas, 1953, 72, 785. [all data]
Coops, Mulder, et al., 1946
Coops, J.; Mulder, D.; Dienske, J.W.; Smittenberg, J.,
The heats of combustion of a number of hydrocarbons,
Rec. Trav. Chim. Pays/Bas, 1946, 65, 128. [all data]
Serijan and Wise, 1951
Serijan, K.T.; Wise, P.H.,
Dicyclic hydrocarbons. III. Diphenyl- and dicyclohexylalkanes through C15,
J. Am. Chem. Soc., 1951, 73, 4766-4769. [all data]
Wise, Serijan, et al., 1951
Wise, C.H.; Serijan, K.T.; Goodman, I.A.,
NACA Technical Report 1003,
NACA Technical Report 1003, 1951, 1-10. [all data]
Messerly, Finke, et al., 1988
Messerly, J.F.; Finke, H.L.; Good, W.D.; Gammon, B.E.,
Condensed-phase heat capacities and derived thermodynamic properties for 1,4-dimethylbenzene, 1,2-diphenylethane, and 2,3-dimethylnaphthalene,
J. Chem. Thermodynam., 1988, 20, 485-501. [all data]
Huffman, Parks, et al., 1930
Huffman, H.M.; Parks, G.S.; Daniels, A.C.,
Thermal data on organic compounds. VII. The heat capacities, entropies and free energies of twelve aromatic hydrocarbons,
J. Am. Chem. Soc., 1930, 52, 1547-1558. [all data]
Kurbatov, 1950
Kurbatov, V.Ya.,
Specific heats of liquids. III. Specific heat of hydrocarbons with several noncondensed rings,
Zhur. Obshch. Khim., 1950, 20, 1139-1144. [all data]
Schmidt, 1941
Schmidt, W.R.,
Thesis Washington University (St. Louis), 1941. [all data]
Ferry and Thomas, 1933
Ferry, J.D.; Thomas, S.B.,
Some heat capacity data for durene, pentamethylbenzene, stilbene, and dibenzyl,
J. Phys. Chem., 1933, 37, 253-255. [all data]
Smith and Andrews, 1931
Smith, R.H.; Andrews, D.H.,
Thermal energy studies. I. Phenyl derivatives of methane,
ethane and some related compounds. J. Am. Chem. Soc., 1931, 53, 3644-3660. [all data]
Messerly, Finke, et al., 1988, 2
Messerly, J.F.; Finke, H.L.; Good, W.D.; Gammon, B.E.,
Condensed-phase heat capacities and derived thermodynamic properties for 1,4-dimethylbenzene, 1,2-diphenylethane, and 2,3-dimethylnaphthalene,
J. Chem. Thermodyn., 1988, 20, 485. [all data]
Osborn and Scott, 1980
Osborn, A.G.; Scott, D.W.,
Vapor pressures of 17 miscellanenous organic compounds,
J. Chem. Thermodyn., 1980, 12, 429-438. [all data]
Morawetz, 1972
Morawetz, E.,
Enthalpies of vaporization for a number of aromatic compounds,
J. Chem. Thermodyn., 1972, 4, 455. [all data]
Morawetz, 1972, 2
Morawetz, Ernst,
Enthalpies of vaporization for a number of aromatic compounds,
The Journal of Chemical Thermodynamics, 1972, 4, 3, 455-460, https://doi.org/10.1016/0021-9614(72)90029-8
. [all data]
Wolf and Weghofer, 1938
Wolf, K.L.; Weghofer, H.,
Uber sublimationswarmen,
Z. Phys. Chem., 1938, 39, 194-208. [all data]
Lei, Chankalal, et al., 2002
Lei, Ying Duan; Chankalal, Raymond; Chan, Anita; Wania, Frank,
Supercooled Liquid Vapor Pressures of the Polycyclic Aromatic Hydrocarbons,
J. Chem. Eng. Data, 2002, 47, 4, 801-806, https://doi.org/10.1021/je0155148
. [all data]
Sasse, N'guimbi, et al., 1989
Sasse, K.; N'guimbi, J.; Jose, J.; Merlin, J.C.,
Tension de vapeur d'hydrocarbures polyaromatiques dans le domaine 10-3--10 Torr,
Thermochimica Acta, 1989, 146, 53-61, https://doi.org/10.1016/0040-6031(89)87075-3
. [all data]
Stephenson and Malanowski, 1987
Stephenson, Richard M.; Malanowski, Stanislaw,
Handbook of the Thermodynamics of Organic Compounds, 1987, https://doi.org/10.1007/978-94-009-3173-2
. [all data]
Stull, 1947
Stull, Daniel R.,
Vapor Pressure of Pure Substances. Organic and Inorganic Compounds,
Ind. Eng. Chem., 1947, 39, 4, 517-540, https://doi.org/10.1021/ie50448a022
. [all data]
Kratt, Beckhaus, et al., 1983
Kratt, G.; Beckhaus, H.D.; Bernioehr, W.; Ruechardt, C.,
Thermolabile hydrocarbons. XVII. Enthalpies of combustion and formation of ten sym-tetraalkyl-1,2-diarylethanes,
Thermochim. Acta, 1983, 62, 279-294. [all data]
Aihara, 1959
Aihara, A.,
Estimation of the energy of hydrogen bonds formed in crystals. I. Sublimation pressures of some organic molecular crystals and the additivity of lattice energy,
Bull. Chem. Soc. Jpn., 1959, 32, 1242. [all data]
Aihara, 1959, 2
Aihara, Ariyuki,
Estimation of the Energy of Hydrogen Bonds Formed in Crystals. I. Sublimation Pressures of Some Organic Molecular Crystals and the Additivity of Lattice Energy,
Bull. Chem. Soc. Jpn., 1959, 32, 11, 1242-1248, https://doi.org/10.1246/bcsj.32.1242
. [all data]
Cox and Pilcher, 1970, 2
Cox, J.D.; Pilcher, G.,
Thermochemistry of Organic and Organometallic Compounds, Academic Press Inc., London, 1970, 643. [all data]
Bloink, Pausacker, et al., 1951
Bloink, G.J.; Pausacker, K.H.; Jones, A.S.; Lee, W.A.; Peacocke, A.R.; Bright, Norman F.H.; Moffatt, J.S.; Wilkinson, J.H.,
Notes,
J. Chem. Soc., 1951, 622, https://doi.org/10.1039/jr9510000622
. [all data]
Domalski and Hearing, 1996
Domalski, Eugene S.; Hearing, Elizabeth D.,
Heat Capacities and Entropies of Organic Compounds in the Condensed Phase. Volume III,
J. Phys. Chem. Ref. Data, 1996, 25, 1, 1, https://doi.org/10.1063/1.555985
. [all data]
Davis, Allinger, et al., 1985
Davis, H.E.; Allinger, N.L.; Rogers, D.W.,
Enthalpies of hydrogenation of phenylalkynes: indirect determination of the enthalpy of formation of diphenylcyclopropenone,
J. Org. Chem., 1985, 50, 3601-3604. [all data]
Flitcroft and Skinner, 1958
Flitcroft, T.L.; Skinner, H.A.,
Heats of hydrogenation Part 2.-Acetylene derivatives,
Trans. Faraday Soc., 1958, 54, 47-53. [all data]
Williams, 1942
Williams, R.B.,
Heats of catalytic hydrogenation in solution. I. Apparatus, technique, and the heats of hydrogenation of certain pairs of stereoisomers,
J. Am. Chem. Soc., 1942, 64, 1395-1404. [all data]
Hunter and Lias, 1998
Hunter, E.P.; Lias, S.G.,
Evaluated Gas Phase Basicities and Proton Affinities of Molecules: An Update,
J. Phys. Chem. Ref. Data, 1998, 27, 3, 413-656, https://doi.org/10.1063/1.556018
. [all data]
Pignataro, Mancini, et al., 1972
Pignataro, S.; Mancini, V.; Innorta, G.; Distefano, G.,
Ionization energies and ring orbital interaction in diarylmethanes and diaryleth,
Z. Naturforsch., 1972, 27, 534. [all data]
McLafferty, Wachs, et al., 1970
McLafferty, F.W.; Wachs, T.; Lifshitz, C.; Innorta, G.; Irving, P.,
Substituent effects in unimolecular ion decompositions. XV. Mechanistic interpretations and the quasi-equilibrium theory,
J. Am. Chem. Soc., 1970, 92, 6867. [all data]
Pignataro, Mancini, et al., 1971
Pignataro, S.; Mancini, V.; Ridyard, J.N.A.; Lempka, H.J.,
Photoelectron energy spectra of molecules having classically non-conjugated π-systems,
Chem. Commun., 1971, 142. [all data]
Lang (editor), 1969
Lang (editor), L.,
Absorption Spectra in the Ultraviolet and Visible Region, 1969, 12, 135. [all data]
Gerasimenko, Kirilenko, et al., 1981
Gerasimenko, V.A.; Kirilenko, A.V.; Nabivach, V.M.,
Capillary gas chromatography of aromatic compounds found in coal tar fractions,
J. Chromatogr., 1981, 208, 1, 9-16, https://doi.org/10.1016/S0021-9673(00)87953-4
. [all data]
Shlyakhov, Novikova, et al., 1979
Shlyakhov, A.F.; Novikova, N.V.; Koreshkova, R.I.,
Analysis of a petroleum fraction of bicycle aromatic hydrocarbons by gas capillary chromatography,
Ind. Lab (Engl. Transl.), 1979, 45, 2, 126-130. [all data]
Shlyakhov, Anvaer, et al., 1975
Shlyakhov, A.F.; Anvaer, B.I.; Zolotareva, O.V.; Romina, N.N.; Novikova, N.V.; Koreshkova, R.I.,
On the possibility of group indentification of hydrocarbons by gas chromatography from temperature coefficients of retention indices,
Zh. Anal. Khim., 1975, 30, 788-792. [all data]
Kríz, Popl, et al., 1974
Kríz, J.; Popl, M.; Mostecký, J.,
Retention indices of biphenyls and diphenylalkanes,
J. Chromatogr., 1974, 97, 1, 3-13, https://doi.org/10.1016/S0021-9673(01)97577-6
. [all data]
Toda, Mihara, et al., 1983
Toda, H.; Mihara, S.; Umano, K.; Shibamoto, T.,
Photochemical studies on jasmin oil,
J. Agric. Food Chem., 1983, 31, 3, 554-558, https://doi.org/10.1021/jf00117a022
. [all data]
Song, Lai, et al., 2003
Song, C.; Lai, W.-C.; Madhusudan Reddy, K.; Wei, B.,
Chapter 7. Temperature-programmed retention indices for GC and GC-MS of hydrocarbon fuels and simulated distillation GC of heavy oils
in Analytical advances for hydrocarbon research, Hsu,C.S., ed(s)., Kluwer Academic/Plenum Publishers, New York, 2003, 147-193. [all data]
Lai and Song, 1995
Lai, W.-C.; Song, C.,
Temperature-programmed retention indices for g.c. and g.c.-m.s. analysis of coal- and petroleum-derived liquid fuels,
Fuel, 1995, 74, 10, 1436-1451, https://doi.org/10.1016/0016-2361(95)00108-H
. [all data]
Rostad and Pereira, 1986
Rostad, C.E.; Pereira, W.E.,
Kovats and Lee retention indices determined by gas chromatography/mass spectrometry for organic compounds of environmental interest,
J. Hi. Res. Chromatogr. Chromatogr. Comm., 1986, 9, 6, 328-334, https://doi.org/10.1002/jhrc.1240090603
. [all data]
Baltes and Mevissen, 1988
Baltes, W.; Mevissen, L.,
Model reactions on roast aroma formation. VI. Volatile reaction products from the reaction of phenylalanine with glucose during cooking and roasting,
Z. Lebensm. Unters. Forsch., 1988, 187, 3, 209-214, https://doi.org/10.1007/BF01043341
. [all data]
Radulovic, Blagojevic, et al., 2009
Radulovic, N.S.; Blagojevic, P.D.; Palic, R.M.; Zlatkovic, B.K.; Stevanovic, B.M.,
Volatiles from vegetative organs of the paleoendemic resurrection plants Ramonda serbica Panc. and Ramonda nathaliae Panc. at Petrov,
J. Serb. Chem. Soc., 2009, 74, 1, 35-44, https://doi.org/10.2298/JSC0901035R
. [all data]
Elizalde-González, Hutfliess, et al., 1996
Elizalde-González, M.P.; Hutfliess, M.; Hedden, K.,
Retention index system, adsorption characteristics, and sructure correlations of polycyclic aromatic hydrocarbons in fuels,
J. Hi. Res. Chromatogr., 1996, 19, 6, 345-352, https://doi.org/10.1002/jhrc.1240190608
. [all data]
Peng, 1996
Peng, C.T.,
Gas chromatographic identification of aromatic hydrocarbons
in Liquid Scintillation Spectrometry, Cook, G.T.; Harkness, D.D.; MacKenzie, A.B.; Miller, B.F.; Scott, E.M., ed(s)., 1996, 221-232. [all data]
Zenkevich and Chupalov, 1996
Zenkevich, I.G.; Chupalov, A.A.,
New Possibilities of Chromato Mass Pectrometric Identification of Organic Compounds Using Increments of Gas Chromatographic Retention Indices of Molecular Structural Fragments,
Zh. Org. Khim. (Rus.), 1996, 32, 5, 656-666. [all data]
Hathcock and Bertsch, 1993
Hathcock, S.; Bertsch, W.,
Analysis of volatiles associated with industrial scale processing of expanded polystyrene. Part II: Identification and quantitation,
J. Hi. Res. Chromatogr., 1993, 16, 11, 651-659, https://doi.org/10.1002/jhrc.1240161106
. [all data]
Peng, Yang, et al., 1991
Peng, C.T.; Yang, Z.C.; Ding, S.F.,
Prediction of rentention idexes. II. Structure-retention index relationship on polar columns,
J. Chromatogr., 1991, 586, 1, 85-112, https://doi.org/10.1016/0021-9673(91)80028-F
. [all data]
Bundt, Herbel, et al., 1991
Bundt, J.; Herbel, W.; Steinhart, H.; Franke, S.; Francke, W.,
Structure-type separation of diesel fuels by solid phase extraction and identification of the two- and three-ring aromatics by capillary GC-mass spectrometry,
J. Hi. Res. Chromatogr., 1991, 14, 2, 91-98, https://doi.org/10.1002/jhrc.1240140205
. [all data]
Guillén, Blanco, et al., 1989
Guillén, M.D.; Blanco, J.; Bermejo, J.; Blanco, C.G.,
Temperature programmed retention indices of some PAHs on Capillary columns coated with OV-1701 and SE-54,
J. Hi. Res. Chromatogr., 1989, 12, 8, 552-554, https://doi.org/10.1002/jhrc.1240120816
. [all data]
Aracil, Font, et al., 2005
Aracil, I.; Font, R.; Conesa, J.A.,
Semivolatile and volatile compounds from the pyrolysis and combustion of polyvinyl chloride,
J. Anal. Appl. Pyrolysis, 2005, 74, 1-2, 465-478, https://doi.org/10.1016/j.jaap.2004.09.008
. [all data]