Monobenzone
- Formula: C13H12O2
- Molecular weight: 200.2332
- IUPAC Standard InChIKey: VYQNWZOUAUKGHI-UHFFFAOYSA-N
- CAS Registry Number: 103-16-2
- Chemical structure:
View 3d structure (requires JavaScript / HTML 5) - Other names: Phenol, 4-(phenylmethoxy)-; Phenol, p-(benzyloxy)-; p-(Benzyloxy)phenol; p-Hydroxyphenyl benzyl ether; Agerite alba; Alba-Dome; Benoquin; Benzoquin; Benzyl p-hydroxyphenyl ether; Carmifal; Depigman; Dermochinona; Hydroquinone benzyl ether; Hydroquinone monobenzyl ether; Leucodinine; Monobenzon; Monobenzyl ether hydroquinone; Monobenzyl hydroquinone; Pigmex; Superlite; 4-(Benzyloxy)phenol; para-(Benzyloxy)phenol; Benzyl hydroquinone; Hydrochinon monobenzylether; 4-(Phenylmethoxy)phenol; Monobenzyl ether of hydroquinone; Agerite; NSC 2132; Superlite (antioxidant)

Gas phase ion energetics data

Data compiled as indicated in comments:
LLK - Sharon G. Lias, Rhoda D. Levin, and Sherif A. Kafafi
RDSH - Henry M. Rosenstock, Keith Draxl, Bruce W. Steiner, and John T. Herron
Ionization energy determinations
IE (eV) | Method | Reference | Comment |
---|---|---|---|
7.83 | CTS | Weschke, Timpe, et al., 1979 | LLK |
8.2 | EI | Ward, Cooks, et al., 1969 | RDSH |
Appearance energy determinations
Ion | AE (eV) | Other Products | Method | Reference | Comment |
---|---|---|---|---|---|
C7H7+ | 9.9 | ? | EI | Ward, Cooks, et al., 1969 | RDSH |

References

Weschke, Timpe, et al., 1979
Weschke, W.; Timpe, H.-J.; Just, G.,
Untersuchungen an EDA-Komplexen von Benzylarylethern,
J. Prakt. Chem., 1979, 321, 605. [all data]
Ward, Cooks, et al., 1969
Ward, R.S.; Cooks, R.d.; Williams, D.H.,
Substituent effects in mass spectrometry. Mass spectra of substituted phenyl benzyl ethers,
J. Am. Chem. Soc., 1969, 91, 2727. [all data]