4-Isobutylmorpholine
- Formula: C8H17NO
- Molecular weight: 143.2267
- IUPAC Standard InChIKey: QKVSMSABRNCNRS-UHFFFAOYSA-N
- CAS Registry Number: 10315-98-7
- Chemical structure:
View 3d structure (requires JavaScript / HTML 5) - Other names: N-Isobutylmorpholine; Morpholine, 4-(2-methylpropyl)-; Morpholine, 4-isobutyl-

Gas phase ion energetics data

Data compiled by: Sharon G. Lias, Rhoda D. Levin, and Sherif A. Kafafi
Ionization energy determinations
IE (eV) | Method | Reference | Comment |
---|---|---|---|
8.46 ± 0.03 | PE | Colonna, Distefano, et al., 1975 | Vertical value |

References

Colonna, Distefano, et al., 1975
Colonna, F.P.; Distefano, G.; Pignataro, S.; Pitacco, G.; Valentin, E.,
Ionization energies of some amines and enamines and an estimation of their relative basicity in gaseous phase,
J. Chem. Soc. Faraday Trans. 2, 1975, 71, 1572. [all data]