Boron tribromide
- Formula: BBr3
- Molecular weight: 250.523
- IUPAC Standard InChIKey: ILAHWRKJUDSMFH-UHFFFAOYSA-N
- CAS Registry Number: 10294-33-4
- Chemical structure:
View 3d structure (requires JavaScript / HTML 5) - Permanent link for this species. Use this link for bookmarking this species for future reference.

Gas phase thermochemistry data

Quantity | Value | Units | Method | Reference | Comment |
---|---|---|---|---|---|
ΔfH°gas | -204.18 | kJ/mol | Review | Chase, 1998 | Data last reviewed in December, 1964 |
Quantity | Value | Units | Method | Reference | Comment |
S°gas,1 bar | 324.19 | J/mol*K | Review | Chase, 1998 | Data last reviewed in December, 1964 |
Gas Phase Heat Capacity (Shomate Equation)
Cp° = A + B*t + C*t2 + D*t3 +
E/t2
H° − H°298.15= A*t + B*t2/2 +
C*t3/3 + D*t4/4 − E/t + F − H
S° = A*ln(t) + B*t + C*t2/2 + D*t3/3 −
E/(2*t2) + G
Cp = heat capacity (J/mol*K)
H° = standard enthalpy (kJ/mol)
S° = standard entropy (J/mol*K)
t = temperature (K) / 1000.
View plot Requires a JavaScript / HTML 5 canvas capable browser.
Temperature (K) | 1000. to 6000. |
---|---|
A | 79.37927 |
B | 3.158104 |
C | -0.847461 |
D | 0.071881 |
E | -1.156241 |
F | -231.8547 |
G | 412.8424 |
H | -204.1792 |
Reference | Chase, 1998 |
Comment | Data last reviewed in December, 1964 |

Condensed phase thermochemistry data

Quantity | Value | Units | Method | Reference | Comment |
---|---|---|---|---|---|
ΔfH°liquid | -238.49 | kJ/mol | Review | Chase, 1998 | Data last reviewed in December, 1964 |
Quantity | Value | Units | Method | Reference | Comment |
S°liquid,1 bar | 228.87 | J/mol*K | Review | Chase, 1998 | Data last reviewed in December, 1964 |
Liquid Phase Heat Capacity (Shomate Equation)
Cp° = A + B*t + C*t2 + D*t3 +
E/t2
H° − H°298.15= A*t + B*t2/2 +
C*t3/3 + D*t4/4 − E/t + F − H
S° = A*ln(t) + B*t + C*t2/2 + D*t3/3 −
E/(2*t2) + G
Cp = heat capacity (J/mol*K)
H° = standard enthalpy (kJ/mol)
S° = standard entropy (J/mol*K)
t = temperature (K) / 1000.
View plot Requires a JavaScript / HTML 5 canvas capable browser.
Temperature (K) | 298. to 1000. |
---|---|
A | 128.0300 |
B | 4.695411×10-7 |
C | -5.898436×10-7 |
D | 2.491422×10-7 |
E | 3.342912×10-9 |
F | -276.6603 |
G | 383.8021 |
H | -238.4884 |
Reference | Chase, 1998 |
Comment | Data last reviewed in December, 1964 |

Phase change data

Data compiled as indicated in comments:
TRC - Thermodynamics Research Center, NIST Boulder Laboratories, Chris Muzny director
Quantity | Value | Units | Method | Reference | Comment |
---|---|---|---|---|---|
Tfus | 226.15 | K | N/A | Hojendahl, 1946 | Uncertainty assigned by TRC = 1.5 K; TRC |
Quantity | Value | Units | Method | Reference | Comment |
Tc | 573.15 | K | N/A | Hojendahl, 1946 | Uncertainty assigned by TRC = 2.5 K; TRC |
Quantity | Value | Units | Method | Reference | Comment |
ρc | 3.59 | mol/l | N/A | Hojendahl, 1946 | Uncertainty assigned by TRC = 0.080 mol/l; TRC |
Antoine Equation Parameters
log10(P) = A − (B / (T + C))
P = vapor pressure (bar)
T = temperature (K)
View plot Requires a JavaScript / HTML 5 canvas capable browser.
Temperature (K) | A | B | C | Reference | Comment |
---|---|---|---|---|---|
273. to 361.1 | 4.01652 | 1262.484 | -48.318 | Barber, Boynton, et al., 1964 | Coefficents calculated by NIST from author's data. |

Gas phase ion energetics data

Data compiled as indicated in comments:
LLK - Sharon G. Lias, Rhoda D. Levin, and Sherif A. Kafafi
RDSH - Henry M. Rosenstock, Keith Draxl, Bruce W. Steiner, and John T. Herron
Ionization energy determinations
IE (eV) | Method | Reference | Comment |
---|---|---|---|
10.51 ± 0.02 | PE | Bassett and Lloyd, 1971 | LLK |
Appearance energy determinations
Ion | AE (eV) | Other Products | Method | Reference | Comment |
---|---|---|---|---|---|
B+ | 19.6 ± 0.2 | ? | EI | Koski, Kaufman, et al., 1959 | RDSH |
BBr+ | 15.0 ± 0.2 | ? | EI | Koski, Kaufman, et al., 1959 | RDSH |
BBr2+ | 10.7 ± 0.2 | Br | EI | Koski, Kaufman, et al., 1959 | RDSH |

References

Chase, 1998
Chase, M.W., Jr.,
NIST-JANAF Themochemical Tables, Fourth Edition,
J. Phys. Chem. Ref. Data, Monograph 9, 1998, 1-1951. [all data]
Hojendahl, 1946
Hojendahl, K.,
Dielectric Constant, Viscosity, Surface Tension, and Critical Data of Boron Tribromide, Dioxane, and Ethylene Dichloride,
Mat.-Fys. Medd. - K. Dan. Vidensk. Selsk., 1946, 24, 1. [all data]
Barber, Boynton, et al., 1964
Barber, W.F.; Boynton, C.F.; Gallagher, P.E.,
Physical Properties of Boron Tribromide,
J. Chem. Eng. Data, 1964, 9, 1, 137-138, https://doi.org/10.1021/je60020a045
. [all data]
Bassett and Lloyd, 1971
Bassett, P.J.; Lloyd, D.R.,
Photoelectron spectra of halides. Part II.High-resolution spectra of the boron trihalides,
J. Chem. Soc., 1971, (A), 1551. [all data]
Koski, Kaufman, et al., 1959
Koski, W.S.; Kaufman, J.J.; Pachucki, C.F.,
A mass spectroscopic appearance potential study of some boron trihalides,
J. Am. Chem. Soc., 1959, 81, 1326. [all data]