Phosphorous acid, tributyl ester
- Formula: C12H27O3P
- Molecular weight: 250.3147
- IUPAC Standard InChIKey: XTTGYFREQJCEML-UHFFFAOYSA-N
- CAS Registry Number: 102-85-2
- Chemical structure:
View 3d structure (requires JavaScript / HTML 5) - Other names: Tri-n-butyl phosphite; Tributoxyphosphine; Tributyl phosphite; Butyl phosphite ((C4H9O)3P); Tributylfosfit; Syn-O-Ad P-312; Butyl phosphite; 1-Butanol, 1,1',1''-phosphinidynetri-; JP 304; NSC 2675; Phosphorus tributoxide (P(OBu)3)

Gas phase ion energetics data

Data compiled by: Henry M. Rosenstock, Keith Draxl, Bruce W. Steiner, and John T. Herron
Ionization energy determinations
IE (eV) | Method | Reference |
---|---|---|
8.44 ± 0.05 | EI | Distefano, Innorta, et al., 1968 |

References

Distefano, Innorta, et al., 1968
Distefano, G.; Innorta, G.; Pignataro, S.; Foffani, A.,
Correlation between the ionization potentials of transition metal complexes and of the corresponding ligands,
J. Organometal. Chem., 1968, 14, 165. [all data]