Mercury, bis(2,2-dimethylpropyl)-
- Formula: C10H22Hg
- Molecular weight: 342.87
- CAS Registry Number: 10284-49-8

Gas phase thermochemistry data

Data compiled by: José A. Martinho Simões
Quantity | Value | Units | Method | Reference | Comment |
---|---|---|---|---|---|
ΔfH°gas | -83. ± 11. | kJ/mol | Review | Martinho Simões |

Condensed phase thermochemistry data

Data compiled by: José A. Martinho Simões
Quantity | Value | Units | Method | Reference | Comment |
---|---|---|---|---|---|
ΔfH°liquid | -153.8 ± 8.5 | kJ/mol | Review | Martinho Simões | |
Quantity | Value | Units | Method | Reference | Comment |
ΔcH°liquid | -6925.4 ± 8.4 | kJ/mol | CC-SB | Jones, Evans, et al., 1935 | Please also see Pedley and Rylance, 1977 and Cox and Pilcher, 1970. |

Gas phase ion energetics data

Data compiled by: Sharon G. Lias, Rhoda D. Levin, and Sherif A. Kafafi
Ionization energy determinations
IE (eV) | Method | Reference | Comment |
---|---|---|---|
8.30 | PE | Fehlner, Ulman, et al., 1976 | Vertical value |

Phase change data

Data compiled by: José A. Martinho Simões
Quantity | Value | Units | Method | Reference | Comment |
---|---|---|---|---|---|
ΔvapH° | 17.0 ± 1.5 | kcal/mol | CC-SB | Cox and Pilcher, 1970 |

References

Martinho Simões
Martinho Simões, J.A.,
Private communication (see http://webbook.nist.gov/chemistry/om/). [all data]
Jones, Evans, et al., 1935
Jones, W.J.; Evans, D.P.; Gulwell, T.; Griffiths, D.C.,
J. Chem. Soc., 1935, 39.. [all data]
Pedley and Rylance, 1977
Pedley, J.B.; Rylance, J.,
Computer Analysed Thermochemical Data: Organic and Organometallic Compounds, University of Sussex, Brigton, 1977. [all data]
Cox and Pilcher, 1970
Cox, J.D.; Pilcher, G.,
Thermochemistry of Organic and Organometallic Compounds
in Academic Press, New York, 1970. [all data]
Fehlner, Ulman, et al., 1976
Fehlner, T.P.; Ulman, J.; Nugent, W.A.; Kochi, J.K.,
Effect of alkyl substituents on the first ionization potential and on 5d10 ionization in dialkylmercury compounds,
Inorg. Chem., 1976, 15, 2544. [all data]