2-Propen-1-amine, N,N-di-2-propenyl-
- Formula: C9H15N
- Molecular weight: 137.2221
- IUPAC Standard InChIKey: VPYJNCGUESNPMV-UHFFFAOYSA-N
- CAS Registry Number: 102-70-5
- Chemical structure:
View 3d structure (requires JavaScript / HTML 5) - Other names: Triallylamine; (CH2=CHCH2)3N; UN 2610; Tris(2-propenyl)amine

Phase change data

Data compiled by: Robert L. Brown and Stephen E. Stein
Quantity | Value | Units | Method | Reference | Comment |
---|---|---|---|---|---|
Tboil | 423.7 | K | N/A | Aldrich Chemical Company Inc., 1990 | |
Tboil | 428.7 | K | N/A | Weast and Grasselli, 1989 |

Gas phase ion energetics data

Data evaluated as indicated in comments:
HL - Edward P. Hunter and Sharon G. Lias
Data compiled as indicated in comments:
LLK - Sharon G. Lias, Rhoda D. Levin, and Sherif A. Kafafi
Quantity | Value | Units | Method | Reference | Comment |
---|---|---|---|---|---|
Proton affinity (review) | 972.3 | kJ/mol | N/A | Hunter and Lias, 1998 | HL |
Quantity | Value | Units | Method | Reference | Comment |
Gas basicity | 941.3 | kJ/mol | N/A | Hunter and Lias, 1998 | HL |
Ionization energy determinations
IE (eV) | Method | Reference | Comment |
---|---|---|---|
7.6 | PE | Aue and Bowers, 1979 | LLK |
8.3 ± 0.3 | PE | Peel and Willett, 1977 | Vertical value; LLK |
8.30 | PE | Peel and Willett, 1976 | Vertical value; LLK |

References

Aldrich Chemical Company Inc., 1990
Aldrich Chemical Company Inc.,
Catalog Handbook of Fine Chemicals, Aldrich Chemical Company, Inc., Milwaukee WI, 1990, 1. [all data]
Weast and Grasselli, 1989
CRC Handbook of Data on Organic Compounds, 2nd Editon, Weast,R.C and Grasselli, J.G., ed(s)., CRC Press, Inc., Boca Raton, FL, 1989, 1. [all data]
Hunter and Lias, 1998
Hunter, E.P.; Lias, S.G.,
Evaluated Gas Phase Basicities and Proton Affinities of Molecules: An Update,
J. Phys. Chem. Ref. Data, 1998, 27, 3, 413-656, https://doi.org/10.1063/1.556018
. [all data]
Aue and Bowers, 1979
Aue, D.H.; Bowers, M.T.,
Chapter 9. Stabilities of positive ions from equilibrium gas phase basicity measurements
in Ions Chemistry,, ed. M.T. Bowers, 1979. [all data]
Peel and Willett, 1977
Peel, J.B.; Willett, G.D.,
Photoelectron spectroscopic studies of the propyl- and allyl- substituted amines,
Aust. J. Chem., 1977, 30, 2571. [all data]
Peel and Willett, 1976
Peel, J.B.; Willett, G.D.,
Photoelectron spectra of the allyl amines,
Chem. Phys. Lett., 1976, 38, 479. [all data]