Ethene, (methylsulfinyl)-
- Formula: C3H6OS
- Molecular weight: 90.144
- IUPAC Standard InChIKey: UDDBCWCQRQREBI-UHFFFAOYSA-N
- CAS Registry Number: 10258-86-3
- Chemical structure:
View 3d structure (requires JavaScript / HTML 5) - Other names: Sulfoxide, methyl vinyl; Methyl vinyl sulfoxide

Gas phase ion energetics data

Data compiled by: Sharon G. Lias, Rhoda D. Levin, and Sherif A. Kafafi
Ionization energy determinations
IE (eV) | Method | Reference | Comment |
---|---|---|---|
9.02 | PE | Bock and Solouki, 1974 | Vertical value |

References

Bock and Solouki, 1974
Bock, H.; Solouki, B.,
Photoelektronenspektren und molekuleigenschaften, XXXV. Sulfoxide X2SO - beispiele fur den nutzen von korrelations - diagrammen bei der diskussion von substituenteneffekten und von geometrischen storungen,
Chem. Ber., 1974, 107, 2299. [all data]