molybdenum pentachloride
- Formula: Cl5Mo
- Molecular weight: 273.23
- CAS Registry Number: 10241-05-1

Condensed phase thermochemistry data

Quantity | Value | Units | Method | Reference | Comment |
---|---|---|---|---|---|
ΔfH°liquid | -510.11 | kJ/mol | Review | Chase, 1998 | Data last reviewed in December, 1968 |
Quantity | Value | Units | Method | Reference | Comment |
S°liquid,1 bar | 273.81 | J/mol*K | Review | Chase, 1998 | Data last reviewed in December, 1968 |
Quantity | Value | Units | Method | Reference | Comment |
ΔfH°solid | -527.18 | kJ/mol | Review | Chase, 1998 | Data last reviewed in December, 1968 |
Quantity | Value | Units | Method | Reference | Comment |
S°solid | 238.60 | J/mol*K | Review | Chase, 1998 | Data last reviewed in December, 1968 |
Liquid Phase Heat Capacity (Shomate Equation)
Cp° = A + B*t + C*t2 + D*t3 +
E/t2
H° − H°298.15= A*t + B*t2/2 +
C*t3/3 + D*t4/4 − E/t + F − H
S° = A*ln(t) + B*t + C*t2/2 + D*t3/3 −
E/(2*t2) + G
Cp = heat capacity (J/mol*K)
H° = standard enthalpy (kJ/mol)
S° = standard entropy (J/mol*K)
t = temperature (K) / 1000.
View plot Requires a JavaScript / HTML 5 canvas capable browser.
Temperature (K) | 467. to 1200. |
---|---|
A | 175.7280 |
B | 0.000000 |
C | 0.000000 |
D | 0.000000 |
E | 0.000000 |
F | -562.5095 |
G | 486.4653 |
H | -510.1133 |
Reference | Chase, 1998 |
Comment | Data last reviewed in December, 1968 |
Solid Phase Heat Capacity (Shomate Equation)
Cp° = A + B*t + C*t2 + D*t3 +
E/t2
H° − H°298.15= A*t + B*t2/2 +
C*t3/3 + D*t4/4 − E/t + F − H
S° = A*ln(t) + B*t + C*t2/2 + D*t3/3 −
E/(2*t2) + G
Cp = heat capacity (J/mol*K)
H° = standard enthalpy (kJ/mol)
S° = standard entropy (J/mol*K)
t = temperature (K) / 1000.
View plot Requires a JavaScript / HTML 5 canvas capable browser.
Temperature (K) | 298. to 467. |
---|---|
A | 53.89159 |
B | 343.9022 |
C | -242.4733 |
D | 55.83213 |
E | 1.714650 |
F | -550.7148 |
G | 221.2152 |
H | -527.1840 |
Reference | Chase, 1998 |
Comment | Data last reviewed in December, 1968 |

Gas phase ion energetics data

Data compiled by: Sharon G. Lias, Rhoda D. Levin, and Sherif A. Kafafi
Ionization energy determinations
IE (eV) | Method | Reference | Comment |
---|---|---|---|
8.7 | PE | Egdell and Orchard, 1978 | |
9.2 | EI | Preiss, 1972 | |
9.27 | PE | Egdell and Orchard, 1978 | Vertical value |
Appearance energy determinations
Ion | AE (eV) | Other Products | Method | Reference | Comment |
---|---|---|---|---|---|
ClMo+ | 20.3 | ? | EI | Preiss, 1972 | |
Cl2Mo+ | 17.1 | ? | EI | Preiss, 1972 | |
Cl3Mo+ | 12.9 | ? | EI | Preiss, 1972 | |
Cl4Mo+ | 10.1 | ? | EI | Preiss, 1972 | |
Mo+ | 23.1 | ? | EI | Preiss, 1972 |

Gas phase thermochemistry data

Quantity | Value | Units | Method | Reference | Comment |
---|---|---|---|---|---|
ΔfH°gas | -107.00 | kcal/mol | Review | Chase, 1998 | Data last reviewed in December, 1968 |
Quantity | Value | Units | Method | Reference | Comment |
S°gas,1 bar | 95.079 | cal/mol*K | Review | Chase, 1998 | Data last reviewed in December, 1968 |
Gas Phase Heat Capacity (Shomate Equation)
Cp° = A + B*t + C*t2 + D*t3 +
E/t2
H° − H°298.15= A*t + B*t2/2 +
C*t3/3 + D*t4/4 − E/t + F − H
S° = A*ln(t) + B*t + C*t2/2 + D*t3/3 −
E/(2*t2) + G
Cp = heat capacity (cal/mol*K)
H° = standard enthalpy (kcal/mol)
S° = standard entropy (cal/mol*K)
t = temperature (K) / 1000.
View plot Requires a JavaScript / HTML 5 canvas capable browser.
Temperature (K) | 1200. to 6000. |
---|---|
A | 31.38640 |
B | 0.245527 |
C | 0.097554 |
D | -0.015720 |
E | -0.258616 |
F | -117.2360 |
G | 131.5290 |
H | -107.0000 |
Reference | Chase, 1998 |
Comment | Data last reviewed in December, 1968 |

References

Chase, 1998
Chase, M.W., Jr.,
NIST-JANAF Themochemical Tables, Fourth Edition,
J. Phys. Chem. Ref. Data, Monograph 9, 1998, 1-1951. [all data]
Egdell and Orchard, 1978
Egdell, R.G.; Orchard, A.F.,
Photoelectron spectra of some transition metal pentachlorides,
J. Electron Spectrosc. Relat. Phenom., 1978, 14, 277. [all data]
Preiss, 1972
Preiss, H.,
Massenspektrometrische Untersuchungen an einigen Halogeniden der 5. Haupt- und Nebengruppe,
Z. Anorg. Allg. Chem., 1972, 389, 280. [all data]